{"text_format":"1","workbook":"xlsx","n_sheets":7,"sheets":["Info","Data","Speelschema","Eredivisie","KeukenKampioenDivisie","TweedeDivisie","Nacompetitie"],"not_rendered":{"charts":0,"images":6,"macros":1,"external_links":0,"defined_names":20,"comments":4,"pivot_tables":0},"unopened":[],"bounds":{"document_bytes":16777216,"sheet_cells":100000,"rows_first":2000,"rows_last":500,"rows_between":2000,"halvings":0,"cell_chars":16384,"cell_head_chars":4096},"cells_cut":0,"cells_raw":0,"read":"whole","date_system":"1900"}

{"sheet":"Info","index":0,"n_rows":23,"n_cols":3,"rows_kept":23,"cut":false,"hidden":false,"merged":[]}
[]
[]
[]
[]
[null,null,"Dit Excel-bestand is gemaakt door Nico van der Meer.  "]
[]
[null,null,"Het is een een poging om de voetbalcompetitie leesbaar weer te geven."]
[]
[null,null,"Thuiswedstrijden worden in de kruistabel in de rijen, Uitwedstrijden in de kolommen weergegeven."]
[]
[null,null,"Ga in het blad \"Speelschema\" naar de invuldatum en vul de uitslagen in; deze worden dan automatisch in de desbetreffende kruistabellen ingevuld."]
[]
[null,null,"Mbv de knop \"Standen bijwerken\" in de betreffende tabbladen worden de teams gesorteerd in de standenlijst en in de kruistabel."]
[]
[null,null,"Geprobeerd is ook door middel van deze standen de Nacompetitie automatisch in te vullen."]
[]
[null,null,"Het bestand wordt door een macro automatisch zonder wachtwoord beveiligd; dit om vergissingen met formules te voorkomen."]
[]
[]
[]
[null,null,"Veel plezier met het programma!"]
[]
[null,null,"njmvdmeer@outlook.com"]

{"sheet":"Data","index":1,"n_rows":28,"n_cols":9,"rows_kept":28,"cut":false,"hidden":false,"merged":[]}
[]
[null,"Competitie","2018-2019"]
[]
[null,"Eredivisie","ADO Den Haag",null,"Eerste","Almere City FC",null,"Tweede","AFC"]
[null,null,"AFC Ajax",null,null,"FC Den Bosch",null,null,"Barendrecht"]
[null,null,"AZ Alkmaar",null,null,"FC Dordrecht",null,null,"De Treffers"]
[null,null,"De Graafschap",null,null,"FC Eindhoven",null,null,"Excelsior Maassluis"]
[null,null,"FC Emmen",null,null,"FC Twente",null,null,"FC Lienden"]
[null,null,"FC Groningen",null,null,"FC Volendam",null,null,"GVVV"]
[null,null,"FC Utrecht",null,null,"Go Ahead Eagles",null,null,"HHC Hardenberg"]
[null,null,"Feyenoord",null,null,"Helmond Sport",null,null,"IJsselmeervogels"]
[null,null,"Fortuna Sittard",null,null,"Jong Ajax",null,null,"Jong Almere City FC"]
[null,null,"Heracles Almelo",null,null,"Jong AZ Alkmaar",null,null,"Jong Sparta Rotterdam"]
[null,null,"NAC Breda",null,null,"Jong FC Utrecht",null,null,"Jong Vitesse"]
[null,null,"PEC Zwolle",null,null,"Jong PSV",null,null,"Katwijk"]
[null,null,"PSV",null,null,"MVV Maastricht",null,null,"Koninklijke HFC"]
[null,null,"SBV Excelsior",null,null,"NEC Nijmegen",null,null,"Kozakken Boys"]
[null,null,"sc Heerenveen",null,null,"RKC Waalwijk",null,null,"Rijnsburgse Boys"]
[null,null,"Vitesse",null,null,"Roda JC Kerkrade",null,null,"Scheveningen"]
[null,null,"VVV-Venlo",null,null,"SC Cambuur",null,null,"Spakenburg"]
[null,null,"Willem II",null,null,"SC Telstar",null,null,"VVSB"]
[null,null,null,null,null,"Sparta Rotterdam"]
[null,null,null,null,null,"TOP Oss"]
[]
[]
[]
[null,"Beveiligen","Ja"]
[null,"(bij volgende keer openen)"]

{"sheet":"Speelschema","index":2,"n_rows":422,"n_cols":18,"rows_kept":422,"cut":false,"hidden":false,"merged":[[0,1,0,17]]}
[null,{"$f":"\"Competitie \"&Comp","v":"Competitie 2018-2019"}]
[]
[null,"Eredivisie",null,null,null,null,null,"KeukenKampioenDivisie",null,null,null,null,null,"TweedeDivisie"]
[null,"Eredivisie",null,null,"Datum","Tijd",null,"Keuken Kampioen Divisie",null,null,"Datum","Tijd",null,"Tweede divisie",null,null,"Datum","Tijd"]
[null,"Ronde 1",null,null,{"$f":"IF(E6>TODAY(),TODAY(),\"\")","v":""},null,null,"Ronde 1",null,null,{"$f":"IF(K6>TODAY(),TODAY(),\"\")","v":""},null,null,"Ronde 1",null,null,{"$f":"IF(Q6>TODAY(),TODAY(),\"\")","v":""}]
[null,"PEC Zwolle - sc Heerenveen",2,3,"2018-08-10","20:00:00",null,"FC Volendam - FC Den Bosch",1,2,"2018-08-17","20:00:00",null,"Excelsior Maassluis - GVVV",1,0,"2018-08-25","15:30:00"]
[null,"Willem II - VVV-Venlo",0,1,"2018-08-11","18:30:00",null,"FC Dordrecht - Helmond Sport",0,0,"2018-08-17","20:00:00",null,"Jong Almere City FC - Rijnsburgse Boys",0,2,"2018-08-25","15:30:00"]
[null,"AFC Ajax - Heracles Almelo",1,1,"2018-08-11","18:30:00",null,"RKC Waalwijk - SC Telstar",1,0,"2018-08-17","20:00:00",null,"Jong Sparta Rotterdam - HHC Hardenberg",3,1,"2018-08-25","15:30:00"]
[null,"PSV - FC Utrecht",4,0,"2018-08-11","20:45:00",null,"MVV Maastricht - TOP Oss",0,2,"2018-08-17","20:00:00",null,"Scheveningen - IJsselmeervogels",1,3,"2018-08-25","15:30:00"]
[null,"SBV Excelsior - Fortuna Sittard",1,1,"2018-08-11","20:45:00",null,"Go Ahead Eagles - Jong FC Utrecht",5,0,"2018-08-17","20:00:00",null,"Spakenburg - Barendrecht",1,0,"2018-08-25","15:30:00"]
[null,"ADO Den Haag - FC Emmen",1,2,"2018-08-12","12:15:00",null,"NEC Nijmegen - SC Cambuur",2,2,"2018-08-17","20:00:00",null,"De Treffers - Katwijk",1,4,"2018-08-25","18:00:00"]
[null,"De Graafschap - Feyenoord",2,0,"2018-08-12","14:30:00",null,"Roda JC Kerkrade - Jong Ajax",2,1,"2018-08-17","20:00:00",null,"Koninklijke HFC - FC Lienden",1,2,"2018-08-25","18:00:00"]
[null,"Vitesse - FC Groningen",5,1,"2018-08-12","14:30:00",null,"FC Twente - Sparta Rotterdam",2,1,"2018-08-17","20:00:00",null,"Kozakken Boys - AFC",0,1,"2018-08-25","18:00:00"]
[null,"AZ Alkmaar - NAC Breda",5,0,"2018-08-12","16:45:00",null,"Jong PSV - FC Eindhoven",2,1,"2018-08-17","20:00:00",null,"VVSB - Jong Vitesse",2,2,"2018-08-25","18:00:00"]
[null,null,null,null,null,null,null,"Jong AZ Alkmaar - Almere City FC",2,3,"2018-08-20","20:00:00"]
[null,"Ronde 2",null,null,null,null,null,"Ronde 2",null,null,null,null,null,"Ronde 2"]
[null,"FC Groningen - Willem II",0,1,"2018-08-17","20:00:00",null,"SC Cambuur - Jong AZ Alkmaar",2,1,"2018-08-24","20:00:00",null,"GVVV - Jong Sparta Rotterdam",null,null,"2018-09-01","15:30:00"]
[null,"NAC Breda - De Graafschap",3,0,"2018-08-18","18:30:00",null,"Sparta Rotterdam - FC Volendam",2,0,"2018-08-24","20:00:00",null,"HHC Hardenberg - Scheveningen",null,null,"2018-09-01","15:30:00"]
[null,"VVV-Venlo - AFC Ajax",0,1,"2018-08-18","18:30:00",null,"FC Den Bosch - RKC Waalwijk",2,3,"2018-08-24","20:00:00",null,"Katwijk - Kozakken Boys",null,null,"2018-09-01","15:30:00"]
[null,"Fortuna Sittard - PSV",1,2,"2018-08-18","20:45:00",null,"TOP Oss - Jong PSV",4,1,"2018-08-24","20:00:00",null,"Rijnsburgse Boys - Excelsior Maassluis",null,null,"2018-09-01","15:30:00"]
[null,"Heracles Almelo - ADO Den Haag",4,2,"2018-08-18","20:45:00",null,"Almere City FC - Roda JC Kerkrade",1,2,"2018-08-24","20:00:00",null,"AFC - Spakenburg",null,null,"2018-09-01","18:00:00"]
[null,"FC Utrecht - PEC Zwolle",2,0,"2018-08-19","12:15:00",null,"SC Telstar - MVV Maastricht",0,1,"2018-08-24","20:00:00",null,"Barendrecht - Koninklijke HFC",null,null,"2018-09-01","18:00:00"]
[null,"Feyenoord - SBV Excelsior",3,0,"2018-08-19","14:30:00",null,"Jong Ajax - FC Dordrecht",5,2,"2018-08-24","20:00:00",null,"IJsselmeervogels - VVSB",null,null,"2018-09-01","18:00:00"]
[null,"FC Emmen - AZ Alkmaar",1,4,"2018-08-19","14:30:00",null,"FC Eindhoven - Go Ahead Eagles",1,2,"2018-08-24","20:00:00",null,"Jong Vitesse - Jong Almere City FC",null,null,"2018-09-01","18:00:00"]
[null,"sc Heerenveen - Vitesse",1,1,"2018-08-19","16:45:00",null,"Helmond Sport - FC Twente",2,2,"2018-08-24","20:00:00",null,"FC Lienden - De Treffers",null,null,"2018-09-02","14:30:00"]
[null,null,null,null,null,null,null,"Jong FC Utrecht - NEC Nijmegen",1,2,"2018-08-27","20:00:00"]
[null,"Ronde 3",null,null,null,null,null,"Ronde 3",null,null,null,null,null,"Ronde 3"]
[null,"ADO Den Haag - Fortuna Sittard",3,1,"2018-08-24","20:00:00",null,"RKC Waalwijk - Sparta Rotterdam",null,null,"2018-08-31","20:00:00",null,"Excelsior Maassluis - IJsselmeervogels",null,null,"2018-09-08","15:30:00"]
[null,"AFC Ajax - FC Emmen",5,0,"2018-08-25","18:30:00",null,"MVV Maastricht - Go Ahead Eagles",null,null,"2018-08-31","20:00:00",null,"Jong Sparta Rotterdam - Rijnsburgse Boys",null,null,"2018-09-08","15:30:00"]
[null,"De Graafschap - FC Groningen",0,1,"2018-08-25","18:30:00",null,"FC Den Bosch - Jong Ajax",null,null,"2018-08-31","20:00:00",null,"Scheveningen - GVVV",null,null,"2018-09-08","15:30:00"]
[null,"NAC Breda - SBV Excelsior",0,2,"2018-08-25","20:45:00",null,"NEC Nijmegen - FC Dordrecht",null,null,"2018-08-31","20:00:00",null,"Spakenburg - Katwijk",null,null,"2018-09-08","15:30:00"]
[null,"PEC Zwolle - PSV",1,2,"2018-08-25","20:45:00",null,"TOP Oss - SC Cambuur",null,null,"2018-08-31","20:00:00",null,"De Treffers - Barendrecht",null,null,"2018-09-08","18:00:00"]
[null,"Willem II - Heracles Almelo",5,0,"2018-08-26","12:15:00",null,"FC Twente - Roda JC Kerkrade",null,null,"2018-08-31","20:00:00",null,"Koninklijke HFC - AFC",null,null,"2018-09-08","18:00:00"]
[null,"sc Heerenveen - Feyenoord",3,5,"2018-08-26","14:30:00",null,"FC Volendam - Jong AZ Alkmaar",null,null,"2018-08-31","20:00:00",null,"Jong Almere City FC - FC Lienden",null,null,"2018-09-08","18:00:00"]
[null,"FC Utrecht - VVV-Venlo",1,1,"2018-08-26","14:30:00",null,"SC Telstar - Jong FC Utrecht",null,null,"2018-08-31","20:00:00",null,"Kozakken Boys - Jong Vitesse",null,null,"2018-09-08","18:00:00"]
[null,"AZ Alkmaar - Vitesse",0,0,"2018-08-26","16:45:00",null,"FC Eindhoven - Almere City FC",null,null,"2018-08-31","20:00:00",null,"VVSB - HHC Hardenberg",null,null,"2018-09-08","18:00:00"]
[null,null,null,null,null,null,null,"Jong PSV - Helmond Sport",null,null,"2018-08-31","20:00:00"]
[null,"Ronde 4",null,null,null,null,null,"Ronde 4",null,null,null,null,null,"Ronde 4"]
[null,"FC Emmen - De Graafschap",null,null,"2018-08-31","20:00:00",null,"SC Cambuur - RKC Waalwijk",null,null,"2018-09-07","20:00:00",null,"Barendrecht - Scheveningen",null,null,"2018-09-15","15:30:00"]
[null,"VVV-Venlo - sc Heerenveen",null,null,"2018-09-01","18:30:00",null,"Sparta Rotterdam - FC Eindhoven",null,null,"2018-09-07","20:00:00",null,"GVVV - Jong Almere City FC",null,null,"2018-09-15","15:30:00"]
[null,"PSV - Willem II",null,null,"2018-09-01","19:45:00",null,"FC Dordrecht - SC Telstar",null,null,"2018-09-07","20:00:00",null,"HHC Hardenberg - Excelsior Maassluis",null,null,"2018-09-15","15:30:00"]
[null,"SBV Excelsior - ADO Den Haag",null,null,"2018-09-01","19:45:00",null,"Go Ahead Eagles - FC Volendam",null,null,"2018-09-07","20:00:00",null,"IJsselmeervogels - Jong Sparta Rotterdam",null,null,"2018-09-15","15:30:00"]
[null,"Fortuna Sittard - FC Utrecht",null,null,"2018-09-01","20:45:00",null,"Almere City FC - MVV Maastricht",null,null,"2018-09-07","20:00:00",null,"Rijnsburgse Boys - Kozakken Boys",null,null,"2018-09-15","15:30:00"]
[null,"FC Groningen - PEC Zwolle",null,null,"2018-09-02","12:15:00",null,"Jong FC Utrecht - Jong PSV",null,null,"2018-09-07","20:00:00",null,"Katwijk - VVSB",null,null,"2018-09-15","18:00:00"]
[null,"Heracles Almelo - AZ Alkmaar",null,null,"2018-09-02","14:30:00",null,"Helmond Sport - FC Den Bosch",null,null,"2018-09-07","20:00:00",null,"FC Lienden - Spakenburg",null,null,"2018-09-15","18:00:00"]
[null,"Vitesse - AFC Ajax",null,null,"2018-09-02","14:30:00",null,"FC Twente - TOP Oss",null,null,"2018-09-08","18:30:00",null,"AFC - De Treffers",null,null,"2018-09-16","14:30:00"]
[null,"Feyenoord - NAC Breda",null,null,"2018-09-02","16:45:00",null,"Roda JC Kerkrade - NEC Nijmegen",null,null,"2018-09-08","20:45:00",null,"Jong Vitesse - Koninklijke HFC",null,null,"2018-09-16","14:30:00"]
[null,null,null,null,null,null,null,"Jong AZ Alkmaar - Jong Ajax",null,null,"2018-09-10","20:00:00"]
[null,"Ronde 5",null,null,null,null,null,"Ronde 5",null,null,null,null,null,"Ronde 5"]
[null,"De Graafschap - VVV-Venlo",null,null,"2018-09-15","18:30:00",null,"SC Cambuur - SC Telstar",null,null,"2018-09-14","20:00:00",null,"Excelsior Maassluis - Barendrecht",null,null,"2018-09-22","15:30:00"]
[null,"ADO Den Haag - PSV",null,null,"2018-09-15","18:30:00",null,"FC Volendam - TOP Oss",null,null,"2018-09-14","20:00:00",null,"HHC Hardenberg - Rijnsburgse Boys",null,null,"2018-09-22","15:30:00"]
[null,"Willem II - SBV Excelsior",null,null,"2018-09-15","20:45:00",null,"FC Dordrecht - FC Twente",null,null,"2018-09-14","20:00:00",null,"Jong Sparta Rotterdam - Spakenburg",null,null,"2018-09-22","15:30:00"]
[null,"AFC Ajax - FC Groningen",null,null,"2018-09-15","20:45:00",null,"RKC Waalwijk - Roda JC Kerkrade",null,null,"2018-09-14","20:00:00",null,"Scheveningen - Katwijk",null,null,"2018-09-22","15:30:00"]
[null,"AZ Alkmaar - Feyenoord",null,null,"2018-09-16","12:15:00",null,"FC Eindhoven - MVV Maastricht",null,null,"2018-09-14","20:00:00",null,"GVVV - Jong Vitesse",null,null,"2018-09-22","18:00:00"]
[null,"sc Heerenveen - Heracles Almelo",null,null,"2018-09-16","14:30:00",null,"NEC Nijmegen - Jong PSV",null,null,"2018-09-14","20:00:00",null,"Koninklijke HFC - Kozakken Boys",null,null,"2018-09-22","18:00:00"]
[null,"FC Utrecht - FC Emmen",null,null,"2018-09-16","14:30:00",null,"Almere City FC - Jong FC Utrecht",null,null,"2018-09-14","20:00:00",null,"IJsselmeervogels - FC Lienden",null,null,"2018-09-22","18:00:00"]
[null,"NAC Breda - Fortuna Sittard",null,null,"2018-09-16","14:30:00",null,"Jong AZ Alkmaar - Go Ahead Eagles",null,null,"2018-09-14","20:00:00",null,"Jong Almere City FC - De Treffers",null,null,"2018-09-22","18:00:00"]
[null,"PEC Zwolle - Vitesse",null,null,"2018-09-16","16:45:00",null,"Sparta Rotterdam - FC Den Bosch",null,null,"2018-09-16","14:30:00",null,"VVSB - AFC",null,null,"2018-09-22","18:00:00"]
[null,null,null,null,null,null,null,"Jong Ajax - Helmond Sport",null,null,"2018-09-17","20:00:00"]
[null,"Ronde 6",null,null,null,null,null,"Ronde 6",null,null,null,null,null,"Ronde 6"]
[null,"Heracles Almelo - De Graafschap",null,null,"2018-09-21","20:00:00",null,"Jong FC Utrecht - SC Cambuur",null,null,"2018-09-21","20:00:00",null,"Barendrecht - HHC Hardenberg",null,null,"2018-09-29","15:30:00"]
[null,"Fortuna Sittard - Willem II",null,null,"2018-09-22","18:30:00",null,"RKC Waalwijk - Jong AZ Alkmaar",null,null,"2018-09-21","20:00:00",null,"Katwijk - Excelsior Maassluis",null,null,"2018-09-29","15:30:00"]
[null,"SBV Excelsior - sc Heerenveen",null,null,"2018-09-22","19:45:00",null,"Jong PSV - FC Volendam",null,null,"2018-09-21","20:00:00",null,"Kozakken Boys - GVVV",null,null,"2018-09-29","15:30:00"]
[null,"VVV-Venlo - NAC Breda",null,null,"2018-09-22","19:45:00",null,"MVV Maastricht - FC Dordrecht",null,null,"2018-09-21","20:00:00",null,"Spakenburg - IJsselmeervogels",null,null,"2018-09-29","15:30:00"]
[null,"FC Emmen - PEC Zwolle",null,null,"2018-09-22","20:45:00",null,"Go Ahead Eagles - Jong Ajax",null,null,"2018-09-21","20:00:00",null,"AFC - Jong Almere City FC",null,null,"2018-09-29","18:00:00"]
[null,"Feyenoord - FC Utrecht",null,null,"2018-09-23","12:15:00",null,"FC Den Bosch - Almere City FC",null,null,"2018-09-21","20:00:00",null,"Jong Vitesse - Jong Sparta Rotterdam",null,null,"2018-09-29","18:00:00"]
[null,"Vitesse - ADO Den Haag",null,null,"2018-09-23","14:30:00",null,"Roda JC Kerkrade - FC Eindhoven",null,null,"2018-09-21","20:00:00",null,"FC Lienden - Scheveningen",null,null,"2018-09-29","18:00:00"]
[null,"FC Groningen - AZ Alkmaar",null,null,"2018-09-23","14:30:00",null,"TOP Oss - Sparta Rotterdam",null,null,"2018-09-21","20:00:00",null,"Rijnsburgse Boys - VVSB",null,null,"2018-09-29","18:00:00"]
[null,"PSV - AFC Ajax",null,null,"2018-09-23","16:45:00",null,"SC Telstar - FC Twente",null,null,"2018-09-21","20:00:00",null,"De Treffers - Koninklijke HFC",null,null,"2018-09-30","14:30:00"]
[null,null,null,null,null,null,null,"Helmond Sport - NEC Nijmegen",null,null,"2018-09-21","20:00:00"]
[null,"Ronde 7",null,null,null,null,null,"Ronde 7",null,null,null,null,null,"Ronde 7"]
[null,"sc Heerenveen - ADO Den Haag",null,null,"2018-09-29","18:30:00",null,"SC Cambuur - Roda JC Kerkrade",null,null,"2018-09-28","20:00:00",null,"Excelsior Maassluis - Spakenburg",null,null,"2018-10-06","15:30:00"]
[null,"NAC Breda - PSV",null,null,"2018-09-29","18:30:00",null,"Sparta Rotterdam - FC Dordrecht",null,null,"2018-09-28","20:00:00",null,"HHC Hardenberg - Katwijk",null,null,"2018-10-06","15:30:00"]
[null,"Fortuna Sittard - AFC Ajax",null,null,"2018-09-29","20:45:00",null,"FC Den Bosch - Jong AZ Alkmaar",null,null,"2018-09-28","20:00:00",null,"Jong Sparta Rotterdam - Barendrecht",null,null,"2018-10-06","15:30:00"]
[null,"SBV Excelsior - VVV-Venlo",null,null,"2018-09-29","20:45:00",null,"NEC Nijmegen - Go Ahead Eagles",null,null,"2018-09-28","20:00:00",null,"GVVV - FC Lienden",null,null,"2018-10-06","18:00:00"]
[null,"Heracles Almelo - FC Emmen",null,null,"2018-09-30","12:15:00",null,"Almere City FC - RKC Waalwijk",null,null,"2018-09-28","20:00:00",null,"Koninklijke HFC - Jong Almere City FC",null,null,"2018-10-06","18:00:00"]
[null,"De Graafschap - Willem II",null,null,"2018-09-30","14:30:00",null,"SC Telstar - TOP Oss",null,null,"2018-09-28","20:00:00",null,"IJsselmeervogels - De Treffers",null,null,"2018-10-06","18:00:00"]
[null,"AZ Alkmaar - PEC Zwolle",null,null,"2018-09-30","14:30:00",null,"FC Twente - Jong PSV",null,null,"2018-09-28","20:00:00",null,"Rijnsburgse Boys - Jong Vitesse",null,null,"2018-10-06","18:00:00"]
[null,"FC Groningen - FC Utrecht",null,null,"2018-09-30","14:30:00",null,"Helmond Sport - FC Volendam",null,null,"2018-09-28","20:00:00",null,"Scheveningen - AFC",null,null,"2018-10-06","18:00:00"]
[null,"Feyenoord - Vitesse",null,null,"2018-09-30","16:45:00",null,"Jong Ajax - FC Eindhoven",null,null,"2018-09-28","20:00:00",null,"VVSB - Kozakken Boys",null,null,"2018-10-06","18:00:00"]
[null,null,null,null,null,null,null,"Jong FC Utrecht - MVV Maastricht",null,null,"2018-10-01","20:00:00"]
[null,"Ronde 8",null,null,null,null,null,"Ronde 8",null,null,null,null,null,"Ronde 8"]
[null,"FC Utrecht - NAC Breda",null,null,"2018-10-05","20:00:00",null,"FC Volendam - RKC Waalwijk",null,null,"2018-10-05","20:00:00",null,"Barendrecht - GVVV",null,null,"2018-10-13","15:30:00"]
[null,"ADO Den Haag - FC Groningen",null,null,"2018-10-06","18:30:00",null,"FC Dordrecht - SC Cambuur",null,null,"2018-10-05","20:00:00",null,"Katwijk - Jong Sparta Rotterdam",null,null,"2018-10-13","15:30:00"]
[null,"PEC Zwolle - SBV Excelsior",null,null,"2018-10-06","19:45:00",null,"MVV Maastricht - FC Den Bosch",null,null,"2018-10-05","20:00:00",null,"Kozakken Boys - HHC Hardenberg",null,null,"2018-10-13","15:30:00"]
[null,"PSV - VVV-Venlo",null,null,"2018-10-06","19:45:00",null,"FC Eindhoven - FC Twente",null,null,"2018-10-05","20:00:00",null,"AFC - Excelsior Maassluis",null,null,"2018-10-13","18:00:00"]
[null,"De Graafschap - sc Heerenveen",null,null,"2018-10-06","20:45:00",null,"Go Ahead Eagles - Sparta Rotterdam",null,null,"2018-10-05","20:00:00",null,"De Treffers - Scheveningen",null,null,"2018-10-13","18:00:00"]
[null,"FC Emmen - Fortuna Sittard",null,null,"2018-10-07","12:15:00",null,"Roda JC Kerkrade - Jong PSV",null,null,"2018-10-05","20:00:00",null,"Jong Almere City FC - VVSB",null,null,"2018-10-13","18:00:00"]
[null,"Willem II - Feyenoord",null,null,"2018-10-07","14:30:00",null,"Jong Ajax - SC Telstar",null,null,"2018-10-05","20:00:00",null,"Jong Vitesse - IJsselmeervogels",null,null,"2018-10-13","18:00:00"]
[null,"Vitesse - Heracles Almelo",null,null,"2018-10-07","14:30:00",null,"TOP Oss - Jong FC Utrecht",null,null,"2018-10-05","20:00:00",null,"FC Lienden - Rijnsburgse Boys",null,null,"2018-10-13","18:00:00"]
[null,"AFC Ajax - AZ Alkmaar",null,null,"2018-10-07","16:45:00",null,"Almere City FC - NEC Nijmegen",null,null,"2018-10-05","20:00:00",null,"Spakenburg - Koninklijke HFC",null,null,"2018-10-13","18:00:00"]
[null,null,null,null,null,null,null,"Jong AZ Alkmaar - Helmond Sport",null,null,"2018-10-05","20:00:00"]
[null,"Ronde 9",null,null,null,null,null,"Ronde 9",null,null,null,null,null,"Ronde 9"]
[null,"PSV - FC Emmen",null,null,"2018-10-20","18:30:00",null,"FC Volendam - Almere City FC",null,null,"2018-10-12","20:00:00",null,"Excelsior Maassluis - Kozakken Boys",null,null,"2018-10-20","15:30:00"]
[null,"SBV Excelsior - Vitesse",null,null,"2018-10-20","18:30:00",null,"RKC Waalwijk - TOP Oss",null,null,"2018-10-12","20:00:00",null,"GVVV - Spakenburg",null,null,"2018-10-20","15:30:00"]
[null,"sc Heerenveen - AFC Ajax",null,null,"2018-10-20","20:45:00",null,"FC Den Bosch - FC Dordrecht",null,null,"2018-10-12","20:00:00",null,"Rijnsburgse Boys - Katwijk",null,null,"2018-10-20","15:30:00"]
[null,"FC Utrecht - AZ Alkmaar",null,null,"2018-10-20","20:45:00",null,"NEC Nijmegen - FC Eindhoven",null,null,"2018-10-12","20:00:00",null,"Scheveningen - Jong Almere City FC",null,null,"2018-10-20","15:30:00"]
[null,"NAC Breda - Willem II",null,null,"2018-10-21","12:15:00",null,"Helmond Sport - SC Telstar",null,null,"2018-10-12","20:00:00",null,"HHC Hardenberg - FC Lienden",null,null,"2018-10-20","18:00:00"]
[null,"Heracles Almelo - FC Groningen",null,null,"2018-10-21","14:30:00",null,"Jong AZ Alkmaar - Jong FC Utrecht",null,null,"2018-10-12","20:00:00",null,"IJsselmeervogels - Koninklijke HFC",null,null,"2018-10-20","18:00:00"]
[null,"Feyenoord - PEC Zwolle",null,null,"2018-10-21","14:30:00",null,"Go Ahead Eagles - Roda JC Kerkrade",null,null,"2018-10-14","12:15:00",null,"Jong Sparta Rotterdam - AFC",null,null,"2018-10-20","18:00:00"]
[null,"VVV-Venlo - ADO Den Haag",null,null,"2018-10-21","14:30:00",null,"Sparta Rotterdam - SC Cambuur",null,null,"2018-10-14","14:30:00",null,"Jong Vitesse - Barendrecht",null,null,"2018-10-20","18:00:00"]
[null,"Fortuna Sittard - De Graafschap",null,null,"2018-10-21","16:45:00",null,"FC Twente - MVV Maastricht",null,null,"2018-10-14","16:45:00",null,"VVSB - De Treffers",null,null,"2018-10-20","18:00:00"]
[null,null,null,null,null,null,null,"Jong PSV - Jong Ajax",null,null,"2018-10-15","20:00:00"]
[null,"Ronde 10",null,null,null,null,null,"Ronde 10",null,null,null,null,null,"Ronde 10"]
[null,"FC Emmen - VVV-Venlo",null,null,"2018-10-26","20:00:00",null,"SC Cambuur - Helmond Sport",null,null,"2018-10-19","20:00:00",null,"Barendrecht - Rijnsburgse Boys",null,null,"2018-10-27","15:30:00"]
[null,"ADO Den Haag - NAC Breda",null,null,"2018-10-27","18:30:00",null,"FC Dordrecht - Jong AZ Alkmaar",null,null,"2018-10-19","20:00:00",null,"Jong Almere City FC - HHC Hardenberg",null,null,"2018-10-27","15:30:00"]
[null,"De Graafschap - SBV Excelsior",null,null,"2018-10-27","19:45:00",null,"MVV Maastricht - Jong PSV",null,null,"2018-10-19","20:00:00",null,"Katwijk - IJsselmeervogels",null,null,"2018-10-27","15:30:00"]
[null,"FC Groningen - PSV",null,null,"2018-10-27","19:45:00",null,"FC Eindhoven - FC Volendam",null,null,"2018-10-19","20:00:00",null,"Kozakken Boys - Jong Sparta Rotterdam",null,null,"2018-10-27","15:30:00"]
[null,"PEC Zwolle - Heracles Almelo",null,null,"2018-10-27","20:45:00",null,"Roda JC Kerkrade - Sparta Rotterdam",null,null,"2018-10-19","20:00:00",null,"Spakenburg - Scheveningen",null,null,"2018-10-27","15:30:00"]
[null,"Vitesse - Fortuna Sittard",null,null,"2018-10-28","12:15:00",null,"TOP Oss - FC Den Bosch",null,null,"2018-10-19","20:00:00",null,"AFC - GVVV",null,null,"2018-10-27","18:00:00"]
[null,"Willem II - FC Utrecht",null,null,"2018-10-28","14:30:00",null,"Almere City FC - Go Ahead Eagles",null,null,"2018-10-19","20:00:00",null,"De Treffers - Excelsior Maassluis",null,null,"2018-10-27","18:00:00"]
[null,"AFC Ajax - Feyenoord",null,null,"2018-10-28","14:30:00",null,"SC Telstar - NEC Nijmegen",null,null,"2018-10-19","20:00:00",null,"Koninklijke HFC - VVSB",null,null,"2018-10-27","18:00:00"]
[null,"AZ Alkmaar - sc Heerenveen",null,null,"2018-10-28","16:45:00",null,"Jong Ajax - RKC Waalwijk",null,null,"2018-10-19","20:00:00",null,"FC Lienden - Jong Vitesse",null,null,"2018-10-28","14:30:00"]
[null,null,null,null,null,null,null,"Jong FC Utrecht - FC Twente",null,null,"2018-10-22","20:00:00"]
[null,"Ronde 11",null,null,null,null,null,"Ronde 11",null,null,null,null,null,"Ronde 11"]
[null,"SBV Excelsior - FC Groningen",null,null,"2018-11-02","20:00:00",null,"Sparta Rotterdam - SC Telstar",null,null,"2018-10-26","20:00:00",null,"GVVV - Katwijk",null,null,"2018-11-03","15:30:00"]
[null,"NAC Breda - Heracles Almelo",null,null,"2018-11-03","18:30:00",null,"FC Volendam - Jong Ajax",null,null,"2018-10-26","20:00:00",null,"IJsselmeervogels - Kozakken Boys",null,null,"2018-11-03","15:30:00"]
[null,"AFC Ajax - Willem II",null,null,"2018-11-03","18:30:00",null,"RKC Waalwijk - Jong FC Utrecht",null,null,"2018-10-26","20:00:00",null,"Jong Sparta Rotterdam - Jong Almere City FC",null,null,"2018-11-03","15:30:00"]
[null,"AZ Alkmaar - De Graafschap",null,null,"2018-11-03","20:45:00",null,"Jong PSV - FC Dordrecht",null,null,"2018-10-26","20:00:00",null,"Barendrecht - FC Lienden",null,null,"2018-11-03","18:00:00"]
[null,"PSV - Vitesse",null,null,"2018-11-03","20:45:00",null,"Go Ahead Eagles - SC Cambuur",null,null,"2018-10-26","20:00:00",null,"Excelsior Maassluis - VVSB",null,null,"2018-11-03","18:00:00"]
[null,"sc Heerenveen - FC Emmen",null,null,"2018-11-04","12:15:00",null,"FC Den Bosch - FC Eindhoven",null,null,"2018-10-26","20:00:00",null,"HHC Hardenberg - De Treffers",null,null,"2018-11-03","18:00:00"]
[null,"FC Utrecht - ADO Den Haag",null,null,"2018-11-04","14:30:00",null,"NEC Nijmegen - TOP Oss",null,null,"2018-10-26","20:00:00",null,"Jong Vitesse - Spakenburg",null,null,"2018-11-03","18:00:00"]
[null,"Fortuna Sittard - PEC Zwolle",null,null,"2018-11-04","14:30:00",null,"FC Twente - Almere City FC",null,null,"2018-10-26","20:00:00",null,"Rijnsburgse Boys - AFC",null,null,"2018-11-03","18:00:00"]
[null,"Feyenoord - VVV-Venlo",null,null,"2018-11-04","16:45:00",null,"Helmond Sport - MVV Maastricht",null,null,"2018-10-26","20:00:00",null,"Scheveningen - Koninklijke HFC",null,null,"2018-11-03","18:00:00"]
[null,null,null,null,null,null,null,"Jong AZ Alkmaar - Roda JC Kerkrade",null,null,"2018-10-26","20:00:00"]
[null,"Ronde 12",null,null,null,null,null,"Ronde 12",null,null,null,null,null,"Ronde 12"]
[null,"PEC Zwolle - Willem II",null,null,"2018-11-09","20:00:00",null,"FC Dordrecht - FC Volendam",null,null,"2018-11-02","20:00:00",null,"Jong Almere City FC - IJsselmeervogels",null,null,"2018-11-17","15:30:00"]
[null,"FC Emmen - NAC Breda",null,null,"2018-11-10","18:30:00",null,"SC Cambuur - Jong Ajax",null,null,"2018-11-02","20:00:00",null,"Kozakken Boys - Barendrecht",null,null,"2018-11-17","15:30:00"]
[null,"De Graafschap - PSV",null,null,"2018-11-10","19:45:00",null,"MVV Maastricht - Sparta Rotterdam",null,null,"2018-11-02","20:00:00",null,"Spakenburg - Rijnsburgse Boys",null,null,"2018-11-17","15:30:00"]
[null,"Vitesse - FC Utrecht",null,null,"2018-11-10","19:45:00",null,"NEC Nijmegen - Jong AZ Alkmaar",null,null,"2018-11-02","20:00:00",null,"AFC - HHC Hardenberg",null,null,"2018-11-17","18:00:00"]
[null,"VVV-Venlo - Fortuna Sittard",null,null,"2018-11-10","20:45:00",null,"TOP Oss - FC Eindhoven",null,null,"2018-11-02","20:00:00",null,"De Treffers - GVVV",null,null,"2018-11-17","18:00:00"]
[null,"FC Groningen - sc Heerenveen",null,null,"2018-11-11","12:15:00",null,"SC Telstar - Go Ahead Eagles",null,null,"2018-11-02","20:00:00",null,"Koninklijke HFC - Excelsior Maassluis",null,null,"2018-11-17","18:00:00"]
[null,"SBV Excelsior - AFC Ajax",null,null,"2018-11-11","14:30:00",null,"FC Twente - RKC Waalwijk",null,null,"2018-11-02","20:00:00",null,"Katwijk - Jong Vitesse",null,null,"2018-11-17","18:00:00"]
[null,"ADO Den Haag - AZ Alkmaar",null,null,"2018-11-11","14:30:00",null,"Helmond Sport - Almere City FC",null,null,"2018-11-02","20:00:00",null,"FC Lienden - Jong Sparta Rotterdam",null,null,"2018-11-17","18:00:00"]
[null,"Heracles Almelo - Feyenoord",null,null,"2018-11-11","16:45:00",null,"Jong FC Utrecht - Roda JC Kerkrade",null,null,"2018-11-02","20:00:00",null,"VVSB - Scheveningen",null,null,"2018-11-17","18:00:00"]
[null,null,null,null,null,null,null,"Jong PSV - FC Den Bosch",null,null,"2018-11-05","20:00:00"]
[null,"Ronde 13",null,null,null,null,null,"Ronde 13",null,null,null,null,null,"Ronde 13"]
[null,"PEC Zwolle - ADO Den Haag",null,null,"2018-11-24","18:30:00",null,"Go Ahead Eagles - FC Dordrecht",null,null,"2018-11-09","20:00:00",null,"Excelsior Maassluis - Jong Almere City FC",null,null,"2018-11-24","15:30:00"]
[null,"PSV - sc Heerenveen",null,null,"2018-11-24","18:30:00",null,"Sparta Rotterdam - Jong FC Utrecht",null,null,"2018-11-09","20:00:00",null,"HHC Hardenberg - IJsselmeervogels",null,null,"2018-11-24","15:30:00"]
[null,"NAC Breda - AFC Ajax",null,null,"2018-11-24","20:45:00",null,"FC Volendam - MVV Maastricht",null,null,"2018-11-09","20:00:00",null,"Rijnsburgse Boys - Scheveningen",null,null,"2018-11-24","15:30:00"]
[null,"Fortuna Sittard - Heracles Almelo",null,null,"2018-11-24","20:45:00",null,"RKC Waalwijk - Jong PSV",null,null,"2018-11-09","20:00:00",null,"Spakenburg - Kozakken Boys",null,null,"2018-11-24","15:30:00"]
[null,"FC Emmen - SBV Excelsior",null,null,"2018-11-25","12:15:00",null,"FC Eindhoven - SC Telstar",null,null,"2018-11-09","20:00:00",null,"Barendrecht - AFC",null,null,"2018-11-24","18:00:00"]
[null,"FC Utrecht - De Graafschap",null,null,"2018-11-25","14:30:00",null,"FC Den Bosch - FC Twente",null,null,"2018-11-09","20:00:00",null,"GVVV - VVSB",null,null,"2018-11-24","18:00:00"]
[null,"Feyenoord - FC Groningen",null,null,"2018-11-25","14:30:00",null,"Roda JC Kerkrade - Helmond Sport",null,null,"2018-11-09","20:00:00",null,"Jong Sparta Rotterdam - Koninklijke HFC",null,null,"2018-11-24","18:00:00"]
[null,"Willem II - Vitesse",null,null,"2018-11-25","14:30:00",null,"Jong Ajax - NEC Nijmegen",null,null,"2018-11-09","20:00:00",null,"FC Lienden - Katwijk",null,null,"2018-11-24","18:00:00"]
[null,"VVV-Venlo - AZ Alkmaar",null,null,"2018-11-25","16:45:00",null,"Almere City FC - SC Cambuur",null,null,"2018-11-09","20:00:00",null,"Jong Vitesse - De Treffers",null,null,"2018-11-25","14:30:00"]
[null,null,null,null,null,null,null,"Jong AZ Alkmaar - TOP Oss",null,null,"2018-11-09","20:00:00"]
[null,"Ronde 14",null,null,null,null,null,"Ronde 14",null,null,null,null,null,"Ronde 14"]
[null,"SBV Excelsior - FC Utrecht",null,null,"2018-11-30","20:00:00",null,"Jong PSV - Jong AZ Alkmaar",null,null,"2018-11-17","18:30:00",null,"IJsselmeervogels - GVVV",null,null,"2018-12-01","15:30:00"]
[null,"Vitesse - FC Emmen",null,null,"2018-12-01","18:30:00",null,"FC Dordrecht - FC Eindhoven",null,null,"2018-11-17","19:45:00",null,"Jong Almere City FC - Spakenburg",null,null,"2018-12-01","15:30:00"]
[null,"AZ Alkmaar - Willem II",null,null,"2018-12-01","19:45:00",null,"TOP Oss - Almere City FC",null,null,"2018-11-17","19:45:00",null,"Katwijk - Barendrecht",null,null,"2018-12-01","15:30:00"]
[null,"De Graafschap - PEC Zwolle",null,null,"2018-12-01","19:45:00",null,"Helmond Sport - RKC Waalwijk",null,null,"2018-11-17","19:45:00",null,"Scheveningen - Excelsior Maassluis",null,null,"2018-12-01","15:30:00"]
[null,"sc Heerenveen - Fortuna Sittard",null,null,"2018-12-01","20:45:00",null,"SC Cambuur - FC Volendam",null,null,"2018-11-17","20:45:00",null,"De Treffers - Rijnsburgse Boys",null,null,"2018-12-01","18:00:00"]
[null,"AFC Ajax - ADO Den Haag",null,null,"2018-12-02","12:15:00",null,"MVV Maastricht - Roda JC Kerkrade",null,null,"2018-11-18","12:15:00",null,"Koninklijke HFC - HHC Hardenberg",null,null,"2018-12-01","18:00:00"]
[null,"Feyenoord - PSV",null,null,"2018-12-02","14:30:00",null,"SC Telstar - FC Den Bosch",null,null,"2018-11-18","14:30:00",null,"Kozakken Boys - FC Lienden",null,null,"2018-12-01","18:00:00"]
[null,"Heracles Almelo - VVV-Venlo",null,null,"2018-12-02","14:30:00",null,"FC Twente - Go Ahead Eagles",null,null,"2018-11-18","14:30:00",null,"VVSB - Jong Sparta Rotterdam",null,null,"2018-12-01","18:00:00"]
[null,"FC Groningen - NAC Breda",null,null,"2018-12-02","16:45:00",null,"NEC Nijmegen - Sparta Rotterdam",null,null,"2018-11-18","16:45:00",null,"AFC - Jong Vitesse",null,null,"2018-12-02","14:30:00"]
[null,null,null,null,null,null,null,"Jong FC Utrecht - Jong Ajax",null,null,"2018-11-20","20:00:00"]
[null,"Ronde 15",null,null,null,null,null,"Ronde 15",null,null,null,null,null,"Ronde 15"]
[null,"Fortuna Sittard - AZ Alkmaar",null,null,"2018-12-07","20:00:00",null,"Sparta Rotterdam - Jong PSV",null,null,"2018-11-23","20:00:00",null,"Barendrecht - IJsselmeervogels",null,null,"2018-12-08","15:30:00"]
[null,"Willem II - sc Heerenveen",null,null,"2018-12-08","18:30:00",null,"FC Volendam - Jong FC Utrecht",null,null,"2018-11-23","20:00:00",null,"GVVV - HHC Hardenberg",null,null,"2018-12-08","15:30:00"]
[null,"PSV - SBV Excelsior",null,null,"2018-12-08","18:30:00",null,"RKC Waalwijk - NEC Nijmegen",null,null,"2018-11-23","20:00:00",null,"Jong Sparta Rotterdam - Excelsior Maassluis",null,null,"2018-12-08","15:30:00"]
[null,"PEC Zwolle - AFC Ajax",null,null,"2018-12-08","20:45:00",null,"FC Eindhoven - Helmond Sport",null,null,"2018-11-23","20:00:00",null,"Katwijk - Jong Almere City FC",null,null,"2018-12-08","15:30:00"]
[null,"ADO Den Haag - De Graafschap",null,null,"2018-12-08","20:45:00",null,"Go Ahead Eagles - TOP Oss",null,null,"2018-11-23","20:00:00",null,"Jong Vitesse - Scheveningen",null,null,"2018-12-08","18:00:00"]
[null,"FC Utrecht - Heracles Almelo",null,null,"2018-12-09","12:15:00",null,"FC Den Bosch - SC Cambuur",null,null,"2018-11-23","20:00:00",null,"Kozakken Boys - De Treffers",null,null,"2018-12-08","18:00:00"]
[null,"VVV-Venlo - FC Groningen",null,null,"2018-12-09","14:30:00",null,"Roda JC Kerkrade - SC Telstar",null,null,"2018-11-23","20:00:00",null,"Rijnsburgse Boys - Koninklijke HFC",null,null,"2018-12-08","18:00:00"]
[null,"FC Emmen - Feyenoord",null,null,"2018-12-09","14:30:00",null,"Almere City FC - FC Dordrecht",null,null,"2018-11-23","20:00:00",null,"Spakenburg - VVSB",null,null,"2018-12-08","18:00:00"]
[null,"NAC Breda - Vitesse",null,null,"2018-12-09","16:45:00",null,"Jong Ajax - MVV Maastricht",null,null,"2018-11-23","20:00:00",null,"FC Lienden - AFC",null,null,"2018-12-09","14:30:00"]
[null,null,null,null,null,null,null,"Jong AZ Alkmaar - FC Twente",null,null,"2018-11-26","20:00:00"]
[null,"Ronde 16",null,null,null,null,null,"Ronde 16",null,null,null,null,null,"Ronde 16"]
[null,"Willem II - ADO Den Haag",null,null,"2018-12-14","20:00:00",null,"FC Dordrecht - RKC Waalwijk",null,null,"2018-11-30","20:00:00",null,"IJsselmeervogels - Rijnsburgse Boys",null,null,"2018-12-15","15:30:00"]
[null,"PEC Zwolle - NAC Breda",null,null,"2018-12-15","18:30:00",null,"SC Cambuur - FC Eindhoven",null,null,"2018-11-30","20:00:00",null,"Jong Almere City FC - Kozakken Boys",null,null,"2018-12-15","15:30:00"]
[null,"AZ Alkmaar - SBV Excelsior",null,null,"2018-12-15","19:45:00",null,"MVV Maastricht - Jong AZ Alkmaar",null,null,"2018-11-30","20:00:00",null,"Scheveningen - Jong Sparta Rotterdam",null,null,"2018-12-15","15:30:00"]
[null,"Heracles Almelo - PSV",null,null,"2018-12-15","19:45:00",null,"NEC Nijmegen - FC Volendam",null,null,"2018-11-30","20:00:00",null,"AFC - Katwijk",null,null,"2018-12-15","18:00:00"]
[null,"Vitesse - VVV-Venlo",null,null,"2018-12-15","20:45:00",null,"TOP Oss - Roda JC Kerkrade",null,null,"2018-11-30","20:00:00",null,"De Treffers - Spakenburg",null,null,"2018-12-15","18:00:00"]
[null,"sc Heerenveen - FC Utrecht",null,null,"2018-12-16","12:15:00",null,"SC Telstar - Almere City FC",null,null,"2018-11-30","20:00:00",null,"Excelsior Maassluis - FC Lienden",null,null,"2018-12-15","18:00:00"]
[null,"AFC Ajax - De Graafschap",null,null,"2018-12-16","14:30:00",null,"FC Twente - Jong Ajax",null,null,"2018-11-30","20:00:00",null,"Koninklijke HFC - GVVV",null,null,"2018-12-15","18:00:00"]
[null,"FC Groningen - FC Emmen",null,null,"2018-12-16","14:30:00",null,"Helmond Sport - Sparta Rotterdam",null,null,"2018-11-30","20:00:00",null,"HHC Hardenberg - Jong Vitesse",null,null,"2018-12-15","18:00:00"]
[null,"Feyenoord - Fortuna Sittard",null,null,"2018-12-16","16:45:00",null,"Jong FC Utrecht - FC Den Bosch",null,null,"2018-12-03","20:00:00",null,"VVSB - Barendrecht",null,null,"2018-12-15","18:00:00"]
[null,null,null,null,null,null,null,"Jong PSV - Go Ahead Eagles",null,null,"2018-12-03","20:00:00"]
[null,"Ronde 17",null,null,null,null,null,"Ronde 17",null,null,null,null,null,"Ronde 17"]
[null,"VVV-Venlo - PEC Zwolle",null,null,"2018-12-21","20:00:00",null,"Sparta Rotterdam - Almere City FC",null,null,"2018-12-07","20:00:00",null,"Barendrecht - Jong Almere City FC",null,null,"2019-01-12","15:30:00"]
[null,"Fortuna Sittard - FC Groningen",null,null,"2018-12-22","18:30:00",null,"FC Volendam - FC Twente",null,null,"2018-12-07","20:00:00",null,"Kozakken Boys - Scheveningen",null,null,"2019-01-12","15:30:00"]
[null,"NAC Breda - sc Heerenveen",null,null,"2018-12-22","19:45:00",null,"RKC Waalwijk - MVV Maastricht",null,null,"2018-12-07","20:00:00",null,"Rijnsburgse Boys - GVVV",null,null,"2019-01-12","15:30:00"]
[null,"PSV - AZ Alkmaar",null,null,"2018-12-22","19:45:00",null,"FC Eindhoven - Jong FC Utrecht",null,null,"2018-12-07","20:00:00",null,"Spakenburg - HHC Hardenberg",null,null,"2019-01-12","15:30:00"]
[null,"SBV Excelsior - Heracles Almelo",null,null,"2018-12-22","20:45:00",null,"Go Ahead Eagles - Helmond Sport",null,null,"2018-12-07","20:00:00",null,"AFC - IJsselmeervogels",null,null,"2019-01-12","18:00:00"]
[null,"FC Utrecht - AFC Ajax",null,null,"2018-12-23","12:15:00",null,"FC Den Bosch - NEC Nijmegen",null,null,"2018-12-07","20:00:00",null,"De Treffers - Jong Sparta Rotterdam",null,null,"2019-01-12","18:00:00"]
[null,"De Graafschap - Vitesse",null,null,"2018-12-23","14:30:00",null,"Roda JC Kerkrade - FC Dordrecht",null,null,"2018-12-07","20:00:00",null,"Jong Vitesse - Excelsior Maassluis",null,null,"2019-01-12","18:00:00"]
[null,"ADO Den Haag - Feyenoord",null,null,"2018-12-23","14:30:00",null,"Jong Ajax - TOP Oss",null,null,"2018-12-07","20:00:00",null,"Katwijk - Koninklijke HFC",null,null,"2019-01-12","18:00:00"]
[null,"FC Emmen - Willem II",null,null,"2018-12-23","16:45:00",null,"Jong PSV - SC Cambuur",null,null,"2018-12-10","20:00:00",null,"FC Lienden - VVSB",null,null,"2019-01-13","14:30:00"]
[null,null,null,null,null,null,null,"Jong AZ Alkmaar - SC Telstar",null,null,"2018-12-10","20:00:00"]
[null,"Ronde 18",null,null,null,null,null,"Ronde 18",null,null,null,null,null,"Ronde 18"]
[null,"Vitesse - SBV Excelsior",null,null,"2019-01-18","20:00:00",null,"SC Cambuur - FC Twente",null,null,"2018-12-14","20:00:00",null,"Excelsior Maassluis - Katwijk",null,null,"2019-01-19","15:30:00"]
[null,"AZ Alkmaar - FC Utrecht",null,null,"2019-01-19","18:30:00",null,"Jong FC Utrecht - FC Dordrecht",null,null,"2018-12-14","20:00:00",null,"GVVV - Kozakken Boys",null,null,"2019-01-19","15:30:00"]
[null,"PEC Zwolle - Feyenoord",null,null,"2019-01-19","19:45:00",null,"Sparta Rotterdam - Jong AZ Alkmaar",null,null,"2018-12-14","20:00:00",null,"HHC Hardenberg - Barendrecht",null,null,"2019-01-19","15:30:00"]
[null,"ADO Den Haag - VVV-Venlo",null,null,"2019-01-19","19:45:00",null,"FC Eindhoven - RKC Waalwijk",null,null,"2018-12-14","20:00:00",null,"IJsselmeervogels - Spakenburg",null,null,"2019-01-19","15:30:00"]
[null,"FC Groningen - Heracles Almelo",null,null,"2019-01-19","20:45:00",null,"Go Ahead Eagles - FC Den Bosch",null,null,"2018-12-14","20:00:00",null,"Koninklijke HFC - De Treffers",null,null,"2019-01-19","18:00:00"]
[null,"Willem II - NAC Breda",null,null,"2019-01-20","12:15:00",null,"NEC Nijmegen - MVV Maastricht",null,null,"2018-12-14","20:00:00",null,"Jong Almere City FC - AFC",null,null,"2019-01-19","18:00:00"]
[null,"De Graafschap - Fortuna Sittard",null,null,"2019-01-20","14:30:00",null,"Roda JC Kerkrade - FC Volendam",null,null,"2018-12-14","20:00:00",null,"Jong Sparta Rotterdam - Jong Vitesse",null,null,"2019-01-19","18:00:00"]
[null,"FC Emmen - PSV",null,null,"2019-01-20","14:30:00",null,"TOP Oss - Helmond Sport",null,null,"2018-12-14","20:00:00",null,"Scheveningen - FC Lienden",null,null,"2019-01-19","18:00:00"]
[null,"AFC Ajax - sc Heerenveen",null,null,"2019-01-20","16:45:00",null,"Almere City FC - Jong Ajax",null,null,"2018-12-14","20:00:00",null,"VVSB - Rijnsburgse Boys",null,null,"2019-01-19","18:00:00"]
[null,null,null,null,null,null,null,"SC Telstar - Jong PSV",null,null,"2018-12-14","20:00:00"]
[null,"Ronde 19",null,null,null,null,null,"Ronde 19",null,null,null,null,null,"Ronde 19"]
[null,"sc Heerenveen - AZ Alkmaar",null,null,"2019-01-25","20:00:00",null,"FC Volendam - SC Telstar",null,null,"2018-12-21","20:00:00",null,"Barendrecht - Spakenburg",null,null,"2019-01-26","15:30:00"]
[null,"Heracles Almelo - PEC Zwolle",null,null,"2019-01-26","18:30:00",null,"FC Dordrecht - TOP Oss",null,null,"2018-12-21","20:00:00",null,"GVVV - Excelsior Maassluis",null,null,"2019-01-26","15:30:00"]
[null,"NAC Breda - ADO Den Haag",null,null,"2019-01-26","19:45:00",null,"RKC Waalwijk - Go Ahead Eagles",null,null,"2018-12-21","20:00:00",null,"HHC Hardenberg - Jong Sparta Rotterdam",null,null,"2019-01-26","15:30:00"]
[null,"SBV Excelsior - De Graafschap",null,null,"2019-01-26","19:45:00",null,"Jong PSV - Almere City FC",null,null,"2018-12-21","20:00:00",null,"IJsselmeervogels - Scheveningen",null,null,"2019-01-26","15:30:00"]
[null,"VVV-Venlo - FC Emmen",null,null,"2019-01-26","20:45:00",null,"MVV Maastricht - SC Cambuur",null,null,"2018-12-21","20:00:00",null,"Rijnsburgse Boys - Jong Almere City FC",null,null,"2019-01-26","15:30:00"]
[null,"Fortuna Sittard - Vitesse",null,null,"2019-01-27","12:15:00",null,"FC Den Bosch - Roda JC Kerkrade",null,null,"2018-12-21","20:00:00",null,"AFC - Kozakken Boys",null,null,"2019-01-26","18:00:00"]
[null,"FC Utrecht - Willem II",null,null,"2019-01-27","14:30:00",null,"Jong Ajax - Sparta Rotterdam",null,null,"2018-12-21","20:00:00",null,"Katwijk - De Treffers",null,null,"2019-01-26","18:00:00"]
[null,"Feyenoord - AFC Ajax",null,null,"2019-01-27","14:30:00",null,"FC Twente - NEC Nijmegen",null,null,"2018-12-21","20:00:00",null,"Jong Vitesse - VVSB",null,null,"2019-01-27","14:30:00"]
[null,"PSV - FC Groningen",null,null,"2019-01-27","16:45:00",null,"Helmond Sport - Jong FC Utrecht",null,null,"2018-12-21","20:00:00",null,"FC Lienden - Koninklijke HFC",null,null,"2019-01-27","14:30:00"]
[null,null,null,null,null,null,null,"Jong AZ Alkmaar - FC Eindhoven",null,null,"2018-12-21","20:00:00"]
[null,"Ronde 20",null,null,null,null,null,"Ronde 20",null,null,null,null,null,"Ronde 20"]
[null,"De Graafschap - NAC Breda",null,null,"2019-02-01","20:00:00",null,"SC Cambuur - Sparta Rotterdam",null,null,"2019-01-13","14:30:00",null,"Excelsior Maassluis - Rijnsburgse Boys",null,null,"2019-02-02","15:30:00"]
[null,"Vitesse - sc Heerenveen",null,null,"2019-02-02","18:30:00",null,"Jong FC Utrecht - Jong AZ Alkmaar",null,null,"2019-01-13","14:30:00",null,"Jong Sparta Rotterdam - GVVV",null,null,"2019-02-02","15:30:00"]
[null,"Willem II - FC Groningen",null,null,"2019-02-02","19:45:00",null,"FC Dordrecht - FC Den Bosch",null,null,"2019-01-13","14:30:00",null,"Kozakken Boys - Katwijk",null,null,"2019-02-02","15:30:00"]
[null,"AFC Ajax - VVV-Venlo",null,null,"2019-02-02","19:45:00",null,"MVV Maastricht - FC Twente",null,null,"2019-01-13","14:30:00",null,"Scheveningen - HHC Hardenberg",null,null,"2019-02-02","15:30:00"]
[null,"AZ Alkmaar - FC Emmen",null,null,"2019-02-02","20:45:00",null,"FC Eindhoven - NEC Nijmegen",null,null,"2019-01-13","14:30:00",null,"Koninklijke HFC - Barendrecht",null,null,"2019-02-02","18:00:00"]
[null,"SBV Excelsior - Feyenoord",null,null,"2019-02-03","12:15:00",null,"Roda JC Kerkrade - Go Ahead Eagles",null,null,"2019-01-13","14:30:00",null,"Jong Almere City FC - Jong Vitesse",null,null,"2019-02-02","18:00:00"]
[null,"PEC Zwolle - FC Utrecht",null,null,"2019-02-03","14:30:00",null,"Jong Ajax - Jong PSV",null,null,"2019-01-13","14:30:00",null,"Spakenburg - AFC",null,null,"2019-02-02","18:00:00"]
[null,"PSV - Fortuna Sittard",null,null,"2019-02-03","14:30:00",null,"TOP Oss - RKC Waalwijk",null,null,"2019-01-13","14:30:00",null,"VVSB - IJsselmeervogels",null,null,"2019-02-02","18:00:00"]
[null,"ADO Den Haag - Heracles Almelo",null,null,"2019-02-03","16:45:00",null,"Almere City FC - FC Volendam",null,null,"2019-01-13","14:30:00",null,"De Treffers - FC Lienden",null,null,"2019-02-03","14:30:00"]
[null,null,null,null,null,null,null,"SC Telstar - Helmond Sport",null,null,"2019-01-13","14:30:00"]
[null,"Ronde 21",null,null,null,null,null,"Ronde 21",null,null,null,null,null,"Ronde 21"]
[null,"NAC Breda - AZ Alkmaar",null,null,"2019-02-08","20:00:00",null,"Sparta Rotterdam - Roda JC Kerkrade",null,null,"2019-01-18","20:00:00",null,"GVVV - Scheveningen",null,null,"2019-02-09","15:30:00"]
[null,"Heracles Almelo - AFC Ajax",null,null,"2019-02-09","18:30:00",null,"FC Volendam - FC Eindhoven",null,null,"2019-01-18","20:00:00",null,"IJsselmeervogels - Excelsior Maassluis",null,null,"2019-02-09","15:30:00"]
[null,"sc Heerenveen - PEC Zwolle",null,null,"2019-02-09","18:30:00",null,"RKC Waalwijk - Jong Ajax",null,null,"2019-01-18","20:00:00",null,"Katwijk - Spakenburg",null,null,"2019-02-09","15:30:00"]
[null,"VVV-Venlo - Willem II",null,null,"2019-02-09","20:45:00",null,"Go Ahead Eagles - Almere City FC",null,null,"2019-01-18","20:00:00",null,"Rijnsburgse Boys - Jong Sparta Rotterdam",null,null,"2019-02-09","15:30:00"]
[null,"Feyenoord - De Graafschap",null,null,"2019-02-09","20:45:00",null,"FC Den Bosch - TOP Oss",null,null,"2019-01-18","20:00:00",null,"Barendrecht - De Treffers",null,null,"2019-02-09","18:00:00"]
[null,"Fortuna Sittard - SBV Excelsior",null,null,"2019-02-10","12:15:00",null,"NEC Nijmegen - SC Telstar",null,null,"2019-01-18","20:00:00",null,"HHC Hardenberg - VVSB",null,null,"2019-02-09","18:00:00"]
[null,"FC Groningen - Vitesse",null,null,"2019-02-10","14:30:00",null,"Helmond Sport - SC Cambuur",null,null,"2019-01-18","20:00:00",null,"Jong Vitesse - Kozakken Boys",null,null,"2019-02-09","18:00:00"]
[null,"FC Emmen - ADO Den Haag",null,null,"2019-02-10","14:30:00",null,"Jong AZ Alkmaar - FC Dordrecht",null,null,"2019-01-18","20:00:00",null,"FC Lienden - Jong Almere City FC",null,null,"2019-02-09","18:00:00"]
[null,"FC Utrecht - PSV",null,null,"2019-02-10","16:45:00",null,"FC Twente - Jong FC Utrecht",null,null,"2019-01-18","20:00:00",null,"AFC - Koninklijke HFC",null,null,"2019-02-10","14:30:00"]
[null,null,null,null,null,null,null,"Jong PSV - MVV Maastricht",null,null,"2019-01-21","20:00:00"]
[null,"Ronde 22",null,null,null,null,null,"Ronde 22",null,null,null,null,null,"Ronde 22"]
[null,"ADO Den Haag - PEC Zwolle",null,null,"2019-02-15","20:00:00",null,"SC Cambuur - Go Ahead Eagles",null,null,"2019-01-25","20:00:00",null,"Excelsior Maassluis - HHC Hardenberg",null,null,"2019-02-16","15:30:00"]
[null,"AZ Alkmaar - VVV-Venlo",null,null,"2019-02-16","18:30:00",null,"FC Dordrecht - Jong PSV",null,null,"2019-01-25","20:00:00",null,"Jong Almere City FC - GVVV",null,null,"2019-02-16","15:30:00"]
[null,"sc Heerenveen - PSV",null,null,"2019-02-16","19:45:00",null,"MVV Maastricht - Helmond Sport",null,null,"2019-01-25","20:00:00",null,"Jong Sparta Rotterdam - IJsselmeervogels",null,null,"2019-02-16","15:30:00"]
[null,"Heracles Almelo - Fortuna Sittard",null,null,"2019-02-16","19:45:00",null,"FC Eindhoven - FC Den Bosch",null,null,"2019-01-25","20:00:00",null,"Kozakken Boys - Rijnsburgse Boys",null,null,"2019-02-16","15:30:00"]
[null,"Vitesse - Willem II",null,null,"2019-02-16","20:45:00",null,"Roda JC Kerkrade - Jong AZ Alkmaar",null,null,"2019-01-25","20:00:00",null,"Scheveningen - Barendrecht",null,null,"2019-02-16","15:30:00"]
[null,"AFC Ajax - NAC Breda",null,null,"2019-02-17","12:15:00",null,"TOP Oss - NEC Nijmegen",null,null,"2019-01-25","20:00:00",null,"Koninklijke HFC - Jong Vitesse",null,null,"2019-02-16","18:00:00"]
[null,"SBV Excelsior - FC Emmen",null,null,"2019-02-17","14:30:00",null,"Almere City FC - FC Twente",null,null,"2019-01-25","20:00:00",null,"Spakenburg - FC Lienden",null,null,"2019-02-16","18:00:00"]
[null,"FC Groningen - Feyenoord",null,null,"2019-02-17","14:30:00",null,"SC Telstar - Sparta Rotterdam",null,null,"2019-01-25","20:00:00",null,"VVSB - Katwijk",null,null,"2019-02-16","18:00:00"]
[null,"De Graafschap - FC Utrecht",null,null,"2019-02-17","16:45:00",null,"Jong FC Utrecht - RKC Waalwijk",null,null,"2019-01-28","20:00:00",null,"De Treffers - AFC",null,null,"2019-02-17","14:30:00"]
[null,null,null,null,null,null,null,"Jong Ajax - FC Volendam",null,null,"2019-01-28","20:00:00"]
[null,"Ronde 23",null,null,null,null,null,"Ronde 23",null,null,null,null,null,"Ronde 23"]
[null,"VVV-Venlo - Heracles Almelo",null,null,"2019-02-22","20:00:00",null,"FC Volendam - Sparta Rotterdam",null,null,"2019-02-01","20:00:00",null,"Barendrecht - Kozakken Boys",null,null,"2019-02-23","15:30:00"]
[null,"FC Utrecht - SBV Excelsior",null,null,"2019-02-23","18:30:00",null,"FC Dordrecht - Jong Ajax",null,null,"2019-02-01","20:00:00",null,"IJsselmeervogels - Jong Almere City FC",null,null,"2019-02-23","15:30:00"]
[null,"PEC Zwolle - De Graafschap",null,null,"2019-02-23","19:45:00",null,"RKC Waalwijk - FC Den Bosch",null,null,"2019-02-01","20:00:00",null,"Rijnsburgse Boys - Spakenburg",null,null,"2019-02-23","15:30:00"]
[null,"Fortuna Sittard - sc Heerenveen",null,null,"2019-02-23","19:45:00",null,"MVV Maastricht - SC Telstar",null,null,"2019-02-01","20:00:00",null,"Excelsior Maassluis - Koninklijke HFC",null,null,"2019-02-23","18:00:00"]
[null,"NAC Breda - FC Groningen",null,null,"2019-02-23","20:45:00",null,"Go Ahead Eagles - FC Eindhoven",null,null,"2019-02-01","20:00:00",null,"GVVV - De Treffers",null,null,"2019-02-23","18:00:00"]
[null,"ADO Den Haag - AFC Ajax",null,null,"2019-02-24","12:15:00",null,"NEC Nijmegen - Jong FC Utrecht",null,null,"2019-02-01","20:00:00",null,"HHC Hardenberg - AFC",null,null,"2019-02-23","18:00:00"]
[null,"PSV - Feyenoord",null,null,"2019-02-24","14:30:00",null,"Roda JC Kerkrade - Almere City FC",null,null,"2019-02-01","20:00:00",null,"Jong Sparta Rotterdam - FC Lienden",null,null,"2019-02-23","18:00:00"]
[null,"FC Emmen - Vitesse",null,null,"2019-02-24","14:30:00",null,"FC Twente - Helmond Sport",null,null,"2019-02-01","20:00:00",null,"Jong Vitesse - Katwijk",null,null,"2019-02-23","18:00:00"]
[null,"Willem II - AZ Alkmaar",null,null,"2019-02-24","16:45:00",null,"Jong PSV - TOP Oss",null,null,"2019-02-04","20:00:00",null,"Scheveningen - VVSB",null,null,"2019-02-23","18:00:00"]
[null,null,null,null,null,null,null,"Jong AZ Alkmaar - SC Cambuur",null,null,"2019-02-04","20:00:00"]
[null,"Ronde 24",null,null,null,null,null,"Ronde 24",null,null,null,null,null,"Ronde 24"]
[null,"AZ Alkmaar - Fortuna Sittard",null,null,"2019-03-01","20:00:00",null,"SC Cambuur - NEC Nijmegen",null,null,"2019-02-08","20:00:00",null,"Jong Almere City FC - Jong Sparta Rotterdam",null,null,"2019-03-09","15:30:00"]
[null,"Heracles Almelo - FC Utrecht",null,null,"2019-03-02","18:30:00",null,"Sparta Rotterdam - FC Twente",null,null,"2019-02-08","20:00:00",null,"Katwijk - GVVV",null,null,"2019-03-09","15:30:00"]
[null,"sc Heerenveen - Willem II",null,null,"2019-03-02","19:45:00",null,"FC Den Bosch - FC Volendam",null,null,"2019-02-08","20:00:00",null,"Kozakken Boys - IJsselmeervogels",null,null,"2019-03-09","15:30:00"]
[null,"SBV Excelsior - PSV",null,null,"2019-03-02","19:45:00",null,"TOP Oss - MVV Maastricht",null,null,"2019-02-08","20:00:00",null,"AFC - Rijnsburgse Boys",null,null,"2019-03-09","18:00:00"]
[null,"Vitesse - NAC Breda",null,null,"2019-03-02","20:45:00",null,"Almere City FC - Jong AZ Alkmaar",null,null,"2019-02-08","20:00:00",null,"De Treffers - HHC Hardenberg",null,null,"2019-03-09","18:00:00"]
[null,"De Graafschap - ADO Den Haag",null,null,"2019-03-03","12:15:00",null,"SC Telstar - RKC Waalwijk",null,null,"2019-02-08","20:00:00",null,"Koninklijke HFC - Scheveningen",null,null,"2019-03-09","18:00:00"]
[null,"AFC Ajax - PEC Zwolle",null,null,"2019-03-03","14:30:00",null,"FC Eindhoven - Jong PSV",null,null,"2019-02-08","20:00:00",null,"FC Lienden - Barendrecht",null,null,"2019-03-09","18:00:00"]
[null,"FC Groningen - VVV-Venlo",null,null,"2019-03-03","14:30:00",null,"Helmond Sport - FC Dordrecht",null,null,"2019-02-08","20:00:00",null,"Spakenburg - Jong Vitesse",null,null,"2019-03-09","18:00:00"]
[null,"Feyenoord - FC Emmen",null,null,"2019-03-03","16:45:00",null,"Jong FC Utrecht - Go Ahead Eagles",null,null,"2019-02-11","20:00:00",null,"VVSB - Excelsior Maassluis",null,null,"2019-03-09","18:00:00"]
[null,null,null,null,null,null,null,"Jong Ajax - Roda JC Kerkrade",null,null,"2019-02-11","20:00:00"]
[null,"Ronde 25",null,null,null,null,null,"Ronde 25",null,null,null,null,null,"Ronde 25"]
[null,"FC Utrecht - FC Groningen",null,null,"2019-03-08","20:00:00",null,"FC Volendam - Helmond Sport",null,null,"2019-02-15","20:00:00",null,"HHC Hardenberg - Jong Almere City FC",null,null,"2019-03-16","15:30:00"]
[null,"VVV-Venlo - SBV Excelsior",null,null,"2019-03-09","18:30:00",null,"FC Dordrecht - Sparta Rotterdam",null,null,"2019-02-15","20:00:00",null,"IJsselmeervogels - Katwijk",null,null,"2019-03-16","15:30:00"]
[null,"PSV - NAC Breda",null,null,"2019-03-09","19:45:00",null,"RKC Waalwijk - Almere City FC",null,null,"2019-02-15","20:00:00",null,"Jong Sparta Rotterdam - Kozakken Boys",null,null,"2019-03-16","15:30:00"]
[null,"ADO Den Haag - sc Heerenveen",null,null,"2019-03-09","19:45:00",null,"MVV Maastricht - Jong FC Utrecht",null,null,"2019-02-15","20:00:00",null,"Rijnsburgse Boys - Barendrecht",null,null,"2019-03-16","15:30:00"]
[null,"Willem II - De Graafschap",null,null,"2019-03-09","20:45:00",null,"FC Eindhoven - Jong Ajax",null,null,"2019-02-15","20:00:00",null,"Scheveningen - Spakenburg",null,null,"2019-03-16","15:30:00"]
[null,"PEC Zwolle - AZ Alkmaar",null,null,"2019-03-10","12:15:00",null,"Go Ahead Eagles - NEC Nijmegen",null,null,"2019-02-15","20:00:00",null,"Excelsior Maassluis - De Treffers",null,null,"2019-03-16","18:00:00"]
[null,"Vitesse - Feyenoord",null,null,"2019-03-10","14:30:00",null,"Roda JC Kerkrade - SC Cambuur",null,null,"2019-02-15","20:00:00",null,"GVVV - AFC",null,null,"2019-03-16","18:00:00"]
[null,"FC Emmen - Heracles Almelo",null,null,"2019-03-10","14:30:00",null,"TOP Oss - SC Telstar",null,null,"2019-02-15","20:00:00",null,"VVSB - Koninklijke HFC",null,null,"2019-03-16","18:00:00"]
[null,"AFC Ajax - Fortuna Sittard",null,null,"2019-03-10","16:45:00",null,"Jong AZ Alkmaar - FC Den Bosch",null,null,"2019-02-15","20:00:00",null,"Jong Vitesse - FC Lienden",null,null,"2019-03-17","14:30:00"]
[null,null,null,null,null,null,null,"Jong PSV - FC Twente",null,null,"2019-02-18","20:00:00"]
[null,"Ronde 26",null,null,null,null,null,"Ronde 26",null,null,null,null,null,"Ronde 26"]
[null,"Fortuna Sittard - FC Emmen",null,null,"2019-03-15","20:00:00",null,"SC Cambuur - FC Dordrecht",null,null,"2019-02-22","20:00:00",null,"Jong Almere City FC - Scheveningen",null,null,"2019-03-23","15:30:00"]
[null,"sc Heerenveen - De Graafschap",null,null,"2019-03-16","18:30:00",null,"RKC Waalwijk - FC Volendam",null,null,"2019-02-22","20:00:00",null,"Katwijk - Rijnsburgse Boys",null,null,"2019-03-23","15:30:00"]
[null,"Feyenoord - Willem II",null,null,"2019-03-16","19:45:00",null,"FC Den Bosch - MVV Maastricht",null,null,"2019-02-22","20:00:00",null,"Kozakken Boys - Excelsior Maassluis",null,null,"2019-03-23","15:30:00"]
[null,"NAC Breda - FC Utrecht",null,null,"2019-03-16","19:45:00",null,"NEC Nijmegen - Almere City FC",null,null,"2019-02-22","20:00:00",null,"Spakenburg - GVVV",null,null,"2019-03-23","15:30:00"]
[null,"Heracles Almelo - Vitesse",null,null,"2019-03-16","20:45:00",null,"SC Telstar - Jong Ajax",null,null,"2019-02-22","20:00:00",null,"AFC - Jong Sparta Rotterdam",null,null,"2019-03-23","18:00:00"]
[null,"VVV-Venlo - PSV",null,null,"2019-03-17","12:15:00",null,"FC Twente - FC Eindhoven",null,null,"2019-02-22","20:00:00",null,"Barendrecht - Jong Vitesse",null,null,"2019-03-23","18:00:00"]
[null,"AZ Alkmaar - AFC Ajax",null,null,"2019-03-17","14:30:00",null,"Helmond Sport - Jong AZ Alkmaar",null,null,"2019-02-22","20:00:00",null,"Koninklijke HFC - IJsselmeervogels",null,null,"2019-03-23","18:00:00"]
[null,"FC Groningen - ADO Den Haag",null,null,"2019-03-17","14:30:00",null,"Jong PSV - Roda JC Kerkrade",null,null,"2019-02-22","20:00:00",null,"FC Lienden - HHC Hardenberg",null,null,"2019-03-23","18:00:00"]
[null,"SBV Excelsior - PEC Zwolle",null,null,"2019-03-17","16:45:00",null,"Sparta Rotterdam - Go Ahead Eagles",null,null,"2019-02-24","14:30:00",null,"De Treffers - VVSB",null,null,"2019-03-24","14:30:00"]
[null,null,null,null,null,null,null,"Jong FC Utrecht - TOP Oss",null,null,"2019-02-25","20:00:00"]
[null,"Ronde 27",null,null,null,null,null,"Ronde 27",null,null,null,null,null,"Ronde 27"]
[null,"Willem II - Fortuna Sittard",null,null,"2019-03-30","18:30:00",null,"SC Cambuur - TOP Oss",null,null,"2019-03-01","20:00:00",null,"Excelsior Maassluis - Jong Sparta Rotterdam",null,null,"2019-03-30","15:30:00"]
[null,"ADO Den Haag - Vitesse",null,null,"2019-03-30","18:30:00",null,"Go Ahead Eagles - MVV Maastricht",null,null,"2019-03-01","20:00:00",null,"HHC Hardenberg - GVVV",null,null,"2019-03-30","15:30:00"]
[null,"De Graafschap - Heracles Almelo",null,null,"2019-03-30","19:45:00",null,"Roda JC Kerkrade - FC Twente",null,null,"2019-03-01","20:00:00",null,"IJsselmeervogels - Barendrecht",null,null,"2019-03-30","15:30:00"]
[null,"sc Heerenveen - SBV Excelsior",null,null,"2019-03-30","20:45:00",null,"Almere City FC - FC Eindhoven",null,null,"2019-03-01","20:00:00",null,"Jong Almere City FC - Katwijk",null,null,"2019-03-30","15:30:00"]
[null,"AZ Alkmaar - FC Groningen",null,null,"2019-03-30","20:45:00",null,"Helmond Sport - Jong PSV",null,null,"2019-03-01","20:00:00",null,"De Treffers - Kozakken Boys",null,null,"2019-03-30","18:00:00"]
[null,"NAC Breda - VVV-Venlo",null,null,"2019-03-31","12:15:00",null,"Sparta Rotterdam - RKC Waalwijk",null,null,"2019-03-01","20:00:00",null,"Koninklijke HFC - Rijnsburgse Boys",null,null,"2019-03-30","18:00:00"]
[null,"FC Utrecht - Feyenoord",null,null,"2019-03-31","14:30:00",null,"FC Dordrecht - NEC Nijmegen",null,null,"2019-03-01","20:00:00",null,"Scheveningen - Jong Vitesse",null,null,"2019-03-30","18:00:00"]
[null,"PEC Zwolle - FC Emmen",null,null,"2019-03-31","14:30:00",null,"Jong Ajax - FC Den Bosch",null,null,"2019-03-01","20:00:00",null,"VVSB - Spakenburg",null,null,"2019-03-30","18:00:00"]
[null,"AFC Ajax - PSV",null,null,"2019-03-31","16:45:00",null,"Jong FC Utrecht - SC Telstar",null,null,"2019-03-01","20:00:00",null,"AFC - FC Lienden",null,null,"2019-03-31","14:30:00"]
[null,null,null,null,null,null,null,"Jong AZ Alkmaar - FC Volendam",null,null,"2019-03-04","20:00:00"]
[null,"Ronde 28",null,null,null,null,null,"Ronde 28",null,null,null,null,null,"Ronde 28"]
[null,"Vitesse - AZ Alkmaar",null,null,"2019-04-02","18:30:00",null,"RKC Waalwijk - SC Cambuur",null,null,"2019-03-08","20:00:00",null,"Jong Sparta Rotterdam - Scheveningen",null,null,"2019-04-06","15:30:00"]
[null,"Heracles Almelo - Willem II",null,null,"2019-04-02","19:45:00",null,"MVV Maastricht - Almere City FC",null,null,"2019-03-08","20:00:00",null,"Kozakken Boys - Jong Almere City FC",null,null,"2019-04-06","15:30:00"]
[null,"FC Groningen - De Graafschap",null,null,"2019-04-02","20:45:00",null,"FC Eindhoven - Sparta Rotterdam",null,null,"2019-03-08","20:00:00",null,"Rijnsburgse Boys - IJsselmeervogels",null,null,"2019-04-06","15:30:00"]
[null,"VVV-Venlo - FC Utrecht",null,null,"2019-04-03","18:30:00",null,"FC Den Bosch - Helmond Sport",null,null,"2019-03-08","20:00:00",null,"Barendrecht - VVSB",null,null,"2019-04-06","18:00:00"]
[null,"SBV Excelsior - NAC Breda",null,null,"2019-04-03","19:45:00",null,"NEC Nijmegen - Roda JC Kerkrade",null,null,"2019-03-08","20:00:00",null,"GVVV - Koninklijke HFC",null,null,"2019-04-06","18:00:00"]
[null,"Fortuna Sittard - ADO Den Haag",null,null,"2019-04-03","19:45:00",null,"TOP Oss - FC Twente",null,null,"2019-03-08","20:00:00",null,"Jong Vitesse - HHC Hardenberg",null,null,"2019-04-06","18:00:00"]
[null,"FC Emmen - AFC Ajax",null,null,"2019-04-03","20:45:00",null,"FC Volendam - Go Ahead Eagles",null,null,"2019-03-08","20:00:00",null,"Katwijk - AFC",null,null,"2019-04-06","18:00:00"]
[null,"PSV - PEC Zwolle",null,null,"2019-04-04","18:30:00",null,"SC Telstar - FC Dordrecht",null,null,"2019-03-08","20:00:00",null,"FC Lienden - Excelsior Maassluis",null,null,"2019-04-06","18:00:00"]
[null,"Feyenoord - sc Heerenveen",null,null,"2019-04-04","20:45:00",null,"Jong PSV - Jong FC Utrecht",null,null,"2019-03-08","20:00:00",null,"Spakenburg - De Treffers",null,null,"2019-04-06","18:00:00"]
[null,null,null,null,null,null,null,"Jong Ajax - Jong AZ Alkmaar",null,null,"2019-03-11","20:00:00"]
[null,"Ronde 29",null,null,null,null,null,"Ronde 29",null,null,null,null,null,"Ronde 29"]
[null,"FC Groningen - SBV Excelsior",null,null,"2019-04-06","18:30:00",null,"SC Cambuur - Jong PSV",null,null,"2019-03-15","20:00:00",null,"IJsselmeervogels - HHC Hardenberg",null,null,"2019-04-13","15:30:00"]
[null,"ADO Den Haag - FC Utrecht",null,null,"2019-04-06","18:30:00",null,"Jong FC Utrecht - FC Eindhoven",null,null,"2019-03-15","20:00:00",null,"Jong Almere City FC - Excelsior Maassluis",null,null,"2019-04-13","15:30:00"]
[null,"Willem II - AFC Ajax",null,null,"2019-04-06","19:45:00",null,"FC Dordrecht - Roda JC Kerkrade",null,null,"2019-03-15","20:00:00",null,"Kozakken Boys - Spakenburg",null,null,"2019-04-13","15:30:00"]
[null,"De Graafschap - AZ Alkmaar",null,null,"2019-04-06","20:45:00",null,"MVV Maastricht - RKC Waalwijk",null,null,"2019-03-15","20:00:00",null,"Scheveningen - Rijnsburgse Boys",null,null,"2019-04-13","15:30:00"]
[null,"Heracles Almelo - NAC Breda",null,null,"2019-04-06","20:45:00",null,"NEC Nijmegen - FC Den Bosch",null,null,"2019-03-15","20:00:00",null,"AFC - Barendrecht",null,null,"2019-04-13","18:00:00"]
[null,"FC Emmen - sc Heerenveen",null,null,"2019-04-07","12:15:00",null,"TOP Oss - Jong Ajax",null,null,"2019-03-15","20:00:00",null,"Koninklijke HFC - Jong Sparta Rotterdam",null,null,"2019-04-13","18:00:00"]
[null,"PEC Zwolle - Fortuna Sittard",null,null,"2019-04-07","14:30:00",null,"Almere City FC - Sparta Rotterdam",null,null,"2019-03-15","20:00:00",null,"Katwijk - FC Lienden",null,null,"2019-04-13","18:00:00"]
[null,"VVV-Venlo - Feyenoord",null,null,"2019-04-07","14:30:00",null,"SC Telstar - Jong AZ Alkmaar",null,null,"2019-03-15","20:00:00",null,"VVSB - GVVV",null,null,"2019-04-13","18:00:00"]
[null,"Vitesse - PSV",null,null,"2019-04-07","16:45:00",null,"FC Twente - FC Volendam",null,null,"2019-03-15","20:00:00",null,"De Treffers - Jong Vitesse",null,null,"2019-04-14","14:30:00"]
[null,null,null,null,null,null,null,"Helmond Sport - Go Ahead Eagles",null,null,"2019-03-15","20:00:00"]
[null,"Ronde 30",null,null,null,null,null,"Ronde 30",null,null,null,null,null,"Ronde 30"]
[null,"NAC Breda - FC Emmen",null,null,"2019-04-12","20:00:00",null,"FC Volendam - SC Cambuur",null,null,"2019-03-22","20:00:00",null,"Barendrecht - Katwijk",null,null,"2019-04-20","15:30:00"]
[null,"AZ Alkmaar - ADO Den Haag",null,null,"2019-04-13","18:30:00",null,"RKC Waalwijk - Helmond Sport",null,null,"2019-03-22","20:00:00",null,"Excelsior Maassluis - Scheveningen",null,null,"2019-04-20","15:30:00"]
[null,"Feyenoord - Heracles Almelo",null,null,"2019-04-13","19:45:00",null,"FC Eindhoven - FC Dordrecht",null,null,"2019-03-22","20:00:00",null,"GVVV - IJsselmeervogels",null,null,"2019-04-20","15:30:00"]
[null,"Fortuna Sittard - VVV-Venlo",null,null,"2019-04-13","19:45:00",null,"FC Den Bosch - SC Telstar",null,null,"2019-03-22","20:00:00",null,"Spakenburg - Jong Almere City FC",null,null,"2019-04-20","15:30:00"]
[null,"Willem II - PEC Zwolle",null,null,"2019-04-13","20:45:00",null,"Almere City FC - TOP Oss",null,null,"2019-03-22","20:00:00",null,"HHC Hardenberg - Koninklijke HFC",null,null,"2019-04-20","18:00:00"]
[null,"PSV - De Graafschap",null,null,"2019-04-14","12:15:00",null,"Sparta Rotterdam - NEC Nijmegen",null,null,"2019-03-24","12:15:00",null,"Jong Sparta Rotterdam - VVSB",null,null,"2019-04-20","18:00:00"]
[null,"sc Heerenveen - FC Groningen",null,null,"2019-04-14","14:30:00",null,"Go Ahead Eagles - FC Twente",null,null,"2019-03-24","14:30:00",null,"Jong Vitesse - AFC",null,null,"2019-04-20","18:00:00"]
[null,"FC Utrecht - Vitesse",null,null,"2019-04-14","14:30:00",null,"Roda JC Kerkrade - MVV Maastricht",null,null,"2019-03-24","16:45:00",null,"FC Lienden - Kozakken Boys",null,null,"2019-04-20","18:00:00"]
[null,"AFC Ajax - SBV Excelsior",null,null,"2019-04-14","16:45:00",null,"Jong Ajax - Jong FC Utrecht",null,null,"2019-03-25","20:00:00",null,"Rijnsburgse Boys - De Treffers",null,null,"2019-04-20","18:00:00"]
[null,null,null,null,null,null,null,"Jong AZ Alkmaar - Jong PSV",null,null,"2019-03-25","20:00:00"]
[null,"Ronde 31",null,null,null,null,null,"Ronde 31",null,null,null,null,null,"Ronde 31"]
[null,"Heracles Almelo - sc Heerenveen",null,null,"2019-04-19","20:00:00",null,"SC Cambuur - Almere City FC",null,null,"2019-03-29","20:00:00",null,"AFC - Scheveningen",null,null,"2019-05-04","15:30:00"]
[null,"FC Emmen - FC Utrecht",null,null,"2019-04-20","18:30:00",null,"Jong FC Utrecht - Sparta Rotterdam",null,null,"2019-03-29","20:00:00",null,"Barendrecht - Jong Sparta Rotterdam",null,null,"2019-05-04","15:30:00"]
[null,"Feyenoord - AZ Alkmaar",null,null,"2019-04-20","19:45:00",null,"FC Dordrecht - Go Ahead Eagles",null,null,"2019-03-29","20:00:00",null,"De Treffers - IJsselmeervogels",null,null,"2019-05-04","15:30:00"]
[null,"Vitesse - PEC Zwolle",null,null,"2019-04-20","19:45:00",null,"Jong PSV - RKC Waalwijk",null,null,"2019-03-29","20:00:00",null,"Jong Almere City FC - Koninklijke HFC",null,null,"2019-05-04","15:30:00"]
[null,"VVV-Venlo - De Graafschap",null,null,"2019-04-20","20:45:00",null,"MVV Maastricht - FC Volendam",null,null,"2019-03-29","20:00:00",null,"Jong Vitesse - Rijnsburgse Boys",null,null,"2019-05-04","15:30:00"]
[null,"SBV Excelsior - Willem II",null,null,"2019-04-21","12:15:00",null,"NEC Nijmegen - Jong Ajax",null,null,"2019-03-29","20:00:00",null,"Katwijk - HHC Hardenberg",null,null,"2019-05-04","15:30:00"]
[null,"Fortuna Sittard - NAC Breda",null,null,"2019-04-21","14:30:00",null,"TOP Oss - Jong AZ Alkmaar",null,null,"2019-03-29","20:00:00",null,"Kozakken Boys - VVSB",null,null,"2019-05-04","15:30:00"]
[null,"FC Groningen - AFC Ajax",null,null,"2019-04-21","14:30:00",null,"SC Telstar - FC Eindhoven",null,null,"2019-03-29","20:00:00",null,"FC Lienden - GVVV",null,null,"2019-05-04","15:30:00"]
[null,"PSV - ADO Den Haag",null,null,"2019-04-21","16:45:00",null,"FC Twente - FC Den Bosch",null,null,"2019-03-29","20:00:00",null,"Spakenburg - Excelsior Maassluis",null,null,"2019-05-04","15:30:00"]
[null,null,null,null,null,null,null,"Helmond Sport - Roda JC Kerkrade",null,null,"2019-03-29","20:00:00"]
[null,"Ronde 32",null,null,null,null,null,"Ronde 32",null,null,null,null,null,"Ronde 32"]
[null,"De Graafschap - FC Emmen",null,null,"2019-04-23","18:30:00",null,"Sparta Rotterdam - MVV Maastricht",null,null,"2019-04-01","20:00:00",null,"GVVV - Barendrecht",null,null,"2019-05-11","15:30:00"]
[null,"sc Heerenveen - VVV-Venlo",null,null,"2019-04-23","19:45:00",null,"FC Volendam - FC Dordrecht",null,null,"2019-04-01","20:00:00",null,"HHC Hardenberg - Kozakken Boys",null,null,"2019-05-11","15:30:00"]
[null,"AZ Alkmaar - Heracles Almelo",null,null,"2019-04-23","20:45:00",null,"RKC Waalwijk - FC Twente",null,null,"2019-04-01","20:00:00",null,"Jong Sparta Rotterdam - Katwijk",null,null,"2019-05-11","15:30:00"]
[null,"NAC Breda - Feyenoord",null,null,"2019-04-24","18:30:00",null,"FC Eindhoven - TOP Oss",null,null,"2019-04-01","20:00:00",null,"Excelsior Maassluis - AFC",null,null,"2019-05-11","18:00:00"]
[null,"FC Utrecht - Fortuna Sittard",null,null,"2019-04-24","19:45:00",null,"Go Ahead Eagles - SC Telstar",null,null,"2019-04-01","20:00:00",null,"Koninklijke HFC - Spakenburg",null,null,"2019-05-11","18:00:00"]
[null,"PEC Zwolle - FC Groningen",null,null,"2019-04-24","19:45:00",null,"FC Den Bosch - Jong PSV",null,null,"2019-04-01","20:00:00",null,"IJsselmeervogels - Jong Vitesse",null,null,"2019-05-11","18:00:00"]
[null,"AFC Ajax - Vitesse",null,null,"2019-04-24","20:45:00",null,"Roda JC Kerkrade - Jong FC Utrecht",null,null,"2019-04-01","20:00:00",null,"Rijnsburgse Boys - FC Lienden",null,null,"2019-05-11","18:00:00"]
[null,"ADO Den Haag - SBV Excelsior",null,null,"2019-04-25","18:30:00",null,"Jong Ajax - SC Cambuur",null,null,"2019-04-01","20:00:00",null,"Scheveningen - De Treffers",null,null,"2019-05-11","18:00:00"]
[null,"Willem II - PSV",null,null,"2019-04-25","20:45:00",null,"Almere City FC - Helmond Sport",null,null,"2019-04-01","20:00:00",null,"VVSB - Jong Almere City FC",null,null,"2019-05-11","18:00:00"]
[null,null,null,null,null,null,null,"Jong AZ Alkmaar - NEC Nijmegen",null,null,"2019-04-01","20:00:00"]
[null,"Ronde 33",null,null,null,null,null,"Ronde 33",null,null,null,null,null,"Ronde 33"]
[null,"FC Utrecht - sc Heerenveen",null,null,"2019-04-28","14:30:00",null,"MVV Maastricht - FC Eindhoven",null,null,"2019-04-05","20:00:00",null,"AFC - VVSB",null,null,"2019-05-18","18:00:00"]
[null,"NAC Breda - PEC Zwolle",null,null,"2019-04-28","14:30:00",null,"Go Ahead Eagles - Jong AZ Alkmaar",null,null,"2019-04-05","20:00:00",null,"Barendrecht - Excelsior Maassluis",null,null,"2019-05-18","18:00:00"]
[null,"PSV - Heracles Almelo",null,null,"2019-04-28","14:30:00",null,"FC Den Bosch - Sparta Rotterdam",null,null,"2019-04-05","20:00:00",null,"De Treffers - Jong Almere City FC",null,null,"2019-05-18","18:00:00"]
[null,"Fortuna Sittard - Feyenoord",null,null,"2019-04-28","14:30:00",null,"Roda JC Kerkrade - RKC Waalwijk",null,null,"2019-04-05","20:00:00",null,"Jong Vitesse - GVVV",null,null,"2019-05-18","18:00:00"]
[null,"SBV Excelsior - AZ Alkmaar",null,null,"2019-04-28","14:30:00",null,"TOP Oss - FC Volendam",null,null,"2019-04-05","20:00:00",null,"Katwijk - Scheveningen",null,null,"2019-05-18","18:00:00"]
[null,"De Graafschap - AFC Ajax",null,null,"2019-04-28","14:30:00",null,"SC Telstar - SC Cambuur",null,null,"2019-04-05","20:00:00",null,"Kozakken Boys - Koninklijke HFC",null,null,"2019-05-18","18:00:00"]
[null,"VVV-Venlo - Vitesse",null,null,"2019-04-28","14:30:00",null,"FC Twente - FC Dordrecht",null,null,"2019-04-05","20:00:00",null,"FC Lienden - IJsselmeervogels",null,null,"2019-05-18","18:00:00"]
[null,"ADO Den Haag - Willem II",null,null,"2019-04-28","14:30:00",null,"Helmond Sport - Jong Ajax",null,null,"2019-04-05","20:00:00",null,"Rijnsburgse Boys - HHC Hardenberg",null,null,"2019-05-18","18:00:00"]
[null,"FC Emmen - FC Groningen",null,null,"2019-04-28","14:30:00",null,"Jong FC Utrecht - Almere City FC",null,null,"2019-04-05","20:00:00",null,"Spakenburg - Jong Sparta Rotterdam",null,null,"2019-05-18","18:00:00"]
[null,null,null,null,null,null,null,"Jong PSV - NEC Nijmegen",null,null,"2019-04-08","20:00:00"]
[null,"Ronde 34",null,null,null,null,null,"Ronde 34",null,null,null,null,null,"Ronde 34"]
[null,"sc Heerenveen - NAC Breda",null,null,"2019-05-12","14:30:00",null,"SC Cambuur - Jong FC Utrecht",null,null,"2019-04-12","20:00:00",null,"Excelsior Maassluis - Jong Vitesse",null,null,"2019-05-25","15:30:00"]
[null,"Feyenoord - ADO Den Haag",null,null,"2019-05-12","14:30:00",null,"FC Volendam - Jong PSV",null,null,"2019-04-12","20:00:00",null,"GVVV - Rijnsburgse Boys",null,null,"2019-05-25","15:30:00"]
[null,"AZ Alkmaar - PSV",null,null,"2019-05-12","14:30:00",null,"FC Dordrecht - MVV Maastricht",null,null,"2019-04-12","20:00:00",null,"Koninklijke HFC - Katwijk",null,null,"2019-05-25","15:30:00"]
[null,"Willem II - FC Emmen",null,null,"2019-05-12","14:30:00",null,"FC Eindhoven - Roda JC Kerkrade",null,null,"2019-04-12","20:00:00",null,"HHC Hardenberg - Spakenburg",null,null,"2019-05-25","15:30:00"]
[null,"PEC Zwolle - VVV-Venlo",null,null,"2019-05-12","14:30:00",null,"NEC Nijmegen - Helmond Sport",null,null,"2019-04-12","20:00:00",null,"IJsselmeervogels - AFC",null,null,"2019-05-25","15:30:00"]
[null,"AFC Ajax - FC Utrecht",null,null,"2019-05-12","14:30:00",null,"Almere City FC - FC Den Bosch",null,null,"2019-04-12","20:00:00",null,"Jong Almere City FC - Barendrecht",null,null,"2019-05-25","15:30:00"]
[null,"Heracles Almelo - SBV Excelsior",null,null,"2019-05-12","14:30:00",null,"FC Twente - SC Telstar",null,null,"2019-04-12","20:00:00",null,"Jong Sparta Rotterdam - De Treffers",null,null,"2019-05-25","15:30:00"]
[null,"Vitesse - De Graafschap",null,null,"2019-05-12","14:30:00",null,"Jong AZ Alkmaar - RKC Waalwijk",null,null,"2019-04-12","20:00:00",null,"Scheveningen - Kozakken Boys",null,null,"2019-05-25","15:30:00"]
[null,"FC Groningen - Fortuna Sittard",null,null,"2019-05-12","14:30:00",null,"Sparta Rotterdam - TOP Oss",null,null,"2019-04-14","14:30:00",null,"VVSB - FC Lienden",null,null,"2019-05-25","15:30:00"]
[null,null,null,null,null,null,null,"Jong Ajax - Go Ahead Eagles",null,null,"2019-04-15","20:00:00"]
[null,null,null,null,null,null,null,"Ronde 35"]
[null,null,null,null,null,null,null,"Sparta Rotterdam - Helmond Sport",null,null,"2019-04-19","20:00:00"]
[null,null,null,null,null,null,null,"FC Volendam - NEC Nijmegen",null,null,"2019-04-19","20:00:00"]
[null,null,null,null,null,null,null,"RKC Waalwijk - FC Dordrecht",null,null,"2019-04-19","20:00:00"]
[null,null,null,null,null,null,null,"FC Eindhoven - SC Cambuur",null,null,"2019-04-19","20:00:00"]
[null,null,null,null,null,null,null,"Go Ahead Eagles - Jong PSV",null,null,"2019-04-19","20:00:00"]
[null,null,null,null,null,null,null,"FC Den Bosch - Jong FC Utrecht",null,null,"2019-04-19","20:00:00"]
[null,null,null,null,null,null,null,"Roda JC Kerkrade - TOP Oss",null,null,"2019-04-19","20:00:00"]
[null,null,null,null,null,null,null,"Jong Ajax - FC Twente",null,null,"2019-04-19","20:00:00"]
[null,null,null,null,null,null,null,"Almere City FC - SC Telstar",null,null,"2019-04-19","20:00:00"]
[null,null,null,null,null,null,null,"Jong AZ Alkmaar - MVV Maastricht",null,null,"2019-04-19","20:00:00"]
[null,null,null,null,null,null,null,"Ronde 36"]
[null,null,null,null,null,null,null,"SC Cambuur - FC Den Bosch",null,null,"2019-04-22","14:30:00"]
[null,null,null,null,null,null,null,"Jong FC Utrecht - FC Volendam",null,null,"2019-04-22","14:30:00"]
[null,null,null,null,null,null,null,"FC Dordrecht - Almere City FC",null,null,"2019-04-22","14:30:00"]
[null,null,null,null,null,null,null,"Jong PSV - Sparta Rotterdam",null,null,"2019-04-22","14:30:00"]
[null,null,null,null,null,null,null,"MVV Maastricht - Jong Ajax",null,null,"2019-04-22","14:30:00"]
[null,null,null,null,null,null,null,"NEC Nijmegen - RKC Waalwijk",null,null,"2019-04-22","14:30:00"]
[null,null,null,null,null,null,null,"TOP Oss - Go Ahead Eagles",null,null,"2019-04-22","14:30:00"]
[null,null,null,null,null,null,null,"SC Telstar - Roda JC Kerkrade",null,null,"2019-04-22","14:30:00"]
[null,null,null,null,null,null,null,"FC Twente - Jong AZ Alkmaar",null,null,"2019-04-22","14:30:00"]
[null,null,null,null,null,null,null,"Helmond Sport - FC Eindhoven",null,null,"2019-04-22","14:30:00"]
[null,null,null,null,null,null,null,"Ronde 37"]
[null,null,null,null,null,null,null,"SC Cambuur - MVV Maastricht",null,null,"2019-04-26","20:00:00"]
[null,null,null,null,null,null,null,"Jong FC Utrecht - Helmond Sport",null,null,"2019-04-26","20:00:00"]
[null,null,null,null,null,null,null,"Sparta Rotterdam - Jong Ajax",null,null,"2019-04-26","20:00:00"]
[null,null,null,null,null,null,null,"FC Eindhoven - Jong AZ Alkmaar",null,null,"2019-04-26","20:00:00"]
[null,null,null,null,null,null,null,"Go Ahead Eagles - RKC Waalwijk",null,null,"2019-04-26","20:00:00"]
[null,null,null,null,null,null,null,"NEC Nijmegen - FC Twente",null,null,"2019-04-26","20:00:00"]
[null,null,null,null,null,null,null,"Roda JC Kerkrade - FC Den Bosch",null,null,"2019-04-26","20:00:00"]
[null,null,null,null,null,null,null,"TOP Oss - FC Dordrecht",null,null,"2019-04-26","20:00:00"]
[null,null,null,null,null,null,null,"Almere City FC - Jong PSV",null,null,"2019-04-26","20:00:00"]
[null,null,null,null,null,null,null,"SC Telstar - FC Volendam",null,null,"2019-04-26","20:00:00"]
[null,null,null,null,null,null,null,"Ronde 38"]
[null,null,null,null,null,null,null,"FC Volendam - Roda JC Kerkrade",null,null,"2019-05-03","20:00:00"]
[null,null,null,null,null,null,null,"FC Dordrecht - Jong FC Utrecht",null,null,"2019-05-03","20:00:00"]
[null,null,null,null,null,null,null,"RKC Waalwijk - FC Eindhoven",null,null,"2019-05-03","20:00:00"]
[null,null,null,null,null,null,null,"Jong PSV - SC Telstar",null,null,"2019-05-03","20:00:00"]
[null,null,null,null,null,null,null,"MVV Maastricht - NEC Nijmegen",null,null,"2019-05-03","20:00:00"]
[null,null,null,null,null,null,null,"FC Den Bosch - Go Ahead Eagles",null,null,"2019-05-03","20:00:00"]
[null,null,null,null,null,null,null,"Jong Ajax - Almere City FC",null,null,"2019-05-03","20:00:00"]
[null,null,null,null,null,null,null,"FC Twente - SC Cambuur",null,null,"2019-05-03","20:00:00"]
[null,null,null,null,null,null,null,"Helmond Sport - TOP Oss",null,null,"2019-05-03","20:00:00"]
[null,null,null,null,null,null,null,"Jong AZ Alkmaar - Sparta Rotterdam",null,null,"2019-05-03","20:00:00"]

{"sheet":"Eredivisie","index":3,"n_rows":30,"n_cols":78,"rows_kept":30,"cut":false,"hidden":false,"merged":[[0,1,0,77]]}
[null,{"$f":"\"Competitie \"&Comp","v":"Competitie 2018-2019"}]
[]
[null,"Eredivisie"]
[]
[null,null,null,{"$f":"B6","v":"PSV"},null,null,{"$f":"B7","v":"AZ Alkmaar"},null,null,{"$f":"B8","v":"AFC Ajax"},null,null,{"$f":"B9","v":"Willem II"},null,null,{"$f":"B10","v":"Feyenoord"},null,null,{"$f":"B11","v":"Vitesse"},null,null,{"$f":"B12","v":"VVV-Venlo"},null,null,{"$f":"B13","v":"sc Heerenveen"},null,null,{"$f":"B14","v":"SBV Excelsior"},null,null,{"$f":"B15","v":"FC Utrecht"},null,null,{"$f":"B16","v":"Heracles Almelo"},null,null,{"$f":"B17","v":"ADO Den Haag"},null,null,{"$f":"B18","v":"De Graafschap"},null,null,{"$f":"B19","v":"NAC Breda"},null,null,{"$f":"B20","v":"FC Groningen"},null,null,{"$f":"B21","v":"FC Emmen"},null,null,{"$f":"B22","v":"Fortuna Sittard"},null,null,{"$f":"B23","v":"PEC Zwolle"},null,null,"Winst thuis","Gelijk thuis","Verlies thuis","Vóór thuis","Tegen thuis",null,"Plaats","Team","Gespeeld","Winst","Gelijk","Verlies","Straf","Punten","Doelsaldo","Vóór","Tegen","Code",null,null,"Nacompetitie"]
[null,{"$f":"BM6","v":"PSV"},null,null,null,null,{"$f":"IF(ISBLANK(VLOOKUP(TEXT($B6,)&\" - \"&TEXT($G$5,),SchemaED,2,0)),\"\",VLOOKUP(TEXT($B6,)&\" - \"&TEXT($G$5,),SchemaED,2,0))","v":""},{"$f":"IF(ISBLANK(VLOOKUP(TEXT($B6,)&\" - \"&TEXT($G$5,),SchemaED,3,0)),\"\",VLOOKUP(TEXT($B6,)&\" - \"&TEXT($G$5,),SchemaED,3,0))","v":""},{"$f":"IF(H6=\"\",\"\",IF(G6>H6,\"w\",IF(G6=H6,\"g\",\"v\")))","v":""},{"$f":"IF(ISBLANK(VLOOKUP(TEXT($B6,)&\" - \"&TEXT($J$5,),SchemaED,2,0)),\"\",VLOOKUP(TEXT($B6,)&\" - \"&TEXT($J$5,),SchemaED,2,0))","v":""},{"$f":"IF(ISBLANK(VLOOKUP(TEXT($B6,)&\" - \"&TEXT($J$5,),SchemaED,3,0)),\"\",VLOOKUP(TEXT($B6,)&\" - \"&TEXT($J$5,),SchemaED,3,0))","v":""},{"$f":"IF(K6=\"\",\"\",IF(J6>K6,\"w\",IF(J6=K6,\"g\",\"v\")))","v":""},{"$f":"IF(ISBLANK(VLOOKUP(TEXT($B6,)&\" - \"&TEXT($M$5,),SchemaED,2,0)),\"\",VLOOKUP(TEXT($B6,)&\" - \"&TEXT($M$5,),SchemaED,2,0))","v":""},{"$f":"IF(ISBLANK(VLOOKUP(TEXT($B6,)&\" - \"&TEXT($M$5,),SchemaED,3,0)),\"\",VLOOKUP(TEXT($B6,)&\" - \"&TEXT($M$5,),SchemaED,3,0))","v":""},{"$f":"IF(N6=\"\",\"\",IF(M6>N6,\"w\",IF(M6=N6,\"g\",\"v\")))","v":""},{"$f":"IF(ISBLANK(VLOOKUP(TEXT($B6,)&\" - \"&TEXT($P$5,),SchemaED,2,0)),\"\",VLOOKUP(TEXT($B6,)&\" - \"&TEXT($P$5,),SchemaED,2,0))","v":""},{"$f":"IF(ISBLANK(VLOOKUP(TEXT($B6,)&\" - \"&TEXT($P$5,),SchemaED,3,0)),\"\",VLOOKUP(TEXT($B6,)&\" - \"&TEXT($P$5,),SchemaED,3,0))","v":""},{"$f":"IF(Q6=\"\",\"\",IF(P6>Q6,\"w\",IF(P6=Q6,\"g\",\"v\")))","v":""},{"$f":"IF(ISBLANK(VLOOKUP(TEXT($B6,)&\" - \"&TEXT($S$5,),SchemaED,2,0)),\"\",VLOOKUP(TEXT($B6,)&\" - \"&TEXT($S$5,),SchemaED,2,0))","v":""},{"$f":"IF(ISBLANK(VLOOKUP(TEXT($B6,)&\" - \"&TEXT($S$5,),SchemaED,3,0)),\"\",VLOOKUP(TEXT($B6,)&\" - \"&TEXT($S$5,),SchemaED,3,0))","v":""},{"$f":"IF(T6=\"\",\"\",IF(S6>T6,\"w\",IF(S6=T6,\"g\",\"v\")))","v":""},{"$f":"IF(ISBLANK(VLOOKUP(TEXT($B6,)&\" - \"&TEXT($V$5,),SchemaED,2,0)),\"\",VLOOKUP(TEXT($B6,)&\" - \"&TEXT($V$5,),SchemaED,2,0))","v":""},{"$f":"IF(ISBLANK(VLOOKUP(TEXT($B6,)&\" - \"&TEXT($V$5,),SchemaED,3,0)),\"\",VLOOKUP(TEXT($B6,)&\" - \"&TEXT($V$5,),SchemaED,3,0))","v":""},{"$f":"IF(W6=\"\",\"\",IF(V6>W6,\"w\",IF(V6=W6,\"g\",\"v\")))","v":""},{"$f":"IF(ISBLANK(VLOOKUP(TEXT($B6,)&\" - \"&TEXT($Y$5,),SchemaED,2,0)),\"\",VLOOKUP(TEXT($B6,)&\" - \"&TEXT($Y$5,),SchemaED,2,0))","v":""},{"$f":"IF(ISBLANK(VLOOKUP(TEXT($B6,)&\" - \"&TEXT($Y$5,),SchemaED,3,0)),\"\",VLOOKUP(TEXT($B6,)&\" - \"&TEXT($Y$5,),SchemaED,3,0))","v":""},{"$f":"IF(Z6=\"\",\"\",IF(Y6>Z6,\"w\",IF(Y6=Z6,\"g\",\"v\")))","v":""},{"$f":"IF(ISBLANK(VLOOKUP(TEXT($B6,)&\" - \"&TEXT($AB$5,),SchemaED,2,0)),\"\",VLOOKUP(TEXT($B6,)&\" - \"&TEXT($AB$5,),SchemaED,2,0))","v":""},{"$f":"IF(ISBLANK(VLOOKUP(TEXT($B6,)&\" - \"&TEXT($AB$5,),SchemaED,3,0)),\"\",VLOOKUP(TEXT($B6,)&\" - \"&TEXT($AB$5,),SchemaED,3,0))","v":""},{"$f":"IF(AC6=\"\",\"\",IF(AB6>AC6,\"w\",IF(AB6=AC6,\"g\",\"v\")))","v":""},{"$f":"IF(ISBLANK(VLOOKUP(TEXT($B6,)&\" - \"&TEXT($AE$5,),SchemaED,2,0)),\"\",VLOOKUP(TEXT($B6,)&\" - \"&TEXT($AE$5,),SchemaED,2,0))","v":4},{"$f":"IF(ISBLANK(VLOOKUP(TEXT($B6,)&\" - \"&TEXT($AE$5,),SchemaED,3,0)),\"\",VLOOKUP(TEXT($B6,)&\" - \"&TEXT($AE$5,),SchemaED,3,0))","v":0},{"$f":"IF(AF6=\"\",\"\",IF(AE6>AF6,\"w\",IF(AE6=AF6,\"g\",\"v\")))","v":"w"},{"$f":"IF(ISBLANK(VLOOKUP(TEXT($B6,)&\" - \"&TEXT($AH$5,),SchemaED,2,0)),\"\",VLOOKUP(TEXT($B6,)&\" - \"&TEXT($AH$5,),SchemaED,2,0))","v":""},{"$f":"IF(ISBLANK(VLOOKUP(TEXT($B6,)&\" - \"&TEXT($AH$5,),SchemaED,3,0)),\"\",VLOOKUP(TEXT($B6,)&\" - \"&TEXT($AH$5,),SchemaED,3,0))","v":""},{"$f":"IF(AI6=\"\",\"\",IF(AH6>AI6,\"w\",IF(AH6=AI6,\"g\",\"v\")))","v":""},{"$f":"IF(ISBLANK(VLOOKUP(TEXT($B6,)&\" - \"&TEXT($AK$5,),SchemaED,2,0)),\"\",VLOOKUP(TEXT($B6,)&\" - \"&TEXT($AK$5,),SchemaED,2,0))","v":""},{"$f":"IF(ISBLANK(VLOOKUP(TEXT($B6,)&\" - \"&TEXT($AK$5,),SchemaED,3,0)),\"\",VLOOKUP(TEXT($B6,)&\" - \"&TEXT($AK$5,),SchemaED,3,0))","v":""},{"$f":"IF(AL6=\"\",\"\",IF(AK6>AL6,\"w\",IF(AK6=AL6,\"g\",\"v\")))","v":""},{"$f":"IF(ISBLANK(VLOOKUP(TEXT($B6,)&\" - \"&TEXT($AN$5,),SchemaED,2,0)),\"\",VLOOKUP(TEXT($B6,)&\" - \"&TEXT($AN$5,),SchemaED,2,0))","v":""},{"$f":"IF(ISBLANK(VLOOKUP(TEXT($B6,)&\" - \"&TEXT($AN$5,),SchemaED,3,0)),\"\",VLOOKUP(TEXT($B6,)&\" - \"&TEXT($AN$5,),SchemaED,3,0))","v":""},{"$f":"IF(AO6=\"\",\"\",IF(AN6>AO6,\"w\",IF(AN6=AO6,\"g\",\"v\")))","v":""},{"$f":"IF(ISBLANK(VLOOKUP(TEXT($B6,)&\" - \"&TEXT($AQ$5,),SchemaED,2,0)),\"\",VLOOKUP(TEXT($B6,)&\" - \"&TEXT($AQ$5,),SchemaED,2,0))","v":""},{"$f":"IF(ISBLANK(VLOOKUP(TEXT($B6,)&\" - \"&TEXT($AQ$5,),SchemaED,3,0)),\"\",VLOOKUP(TEXT($B6,)&\" - \"&TEXT($AQ$5,),SchemaED,3,0))","v":""},{"$f":"IF(AR6=\"\",\"\",IF(AQ6>AR6,\"w\",IF(AQ6=AR6,\"g\",\"v\")))","v":""},{"$f":"IF(ISBLANK(VLOOKUP(TEXT($B6,)&\" - \"&TEXT($AT$5,),SchemaED,2,0)),\"\",VLOOKUP(TEXT($B6,)&\" - \"&TEXT($AT$5,),SchemaED,2,0))","v":""},{"$f":"IF(ISBLANK(VLOOKUP(TEXT($B6,)&\" - \"&TEXT($AT$5,),SchemaED,3,0)),\"\",VLOOKUP(TEXT($B6,)&\" - \"&TEXT($AT$5,),SchemaED,3,0))","v":""},{"$f":"IF(AU6=\"\",\"\",IF(AT6>AU6,\"w\",IF(AT6=AU6,\"g\",\"v\")))","v":""},{"$f":"IF(ISBLANK(VLOOKUP(TEXT($B6,)&\" - \"&TEXT($AW$5,),SchemaED,2,0)),\"\",VLOOKUP(TEXT($B6,)&\" - \"&TEXT($AW$5,),SchemaED,2,0))","v":""},{"$f":"IF(ISBLANK(VLOOKUP(TEXT($B6,)&\" - \"&TEXT($AW$5,),SchemaED,3,0)),\"\",VLOOKUP(TEXT($B6,)&\" - \"&TEXT($AW$5,),SchemaED,3,0))","v":""},{"$f":"IF(AX6=\"\",\"\",IF(AW6>AX6,\"w\",IF(AW6=AX6,\"g\",\"v\")))","v":""},{"$f":"IF(ISBLANK(VLOOKUP(TEXT($B6,)&\" - \"&TEXT($AZ$5,),SchemaED,2,0)),\"\",VLOOKUP(TEXT($B6,)&\" - \"&TEXT($AZ$5,),SchemaED,2,0))","v":""},{"$f":"IF(ISBLANK(VLOOKUP(TEXT($B6,)&\" - \"&TEXT($AZ$5,),SchemaED,3,0)),\"\",VLOOKUP(TEXT($B6,)&\" - \"&TEXT($AZ$5,),SchemaED,3,0))","v":""},{"$f":"IF(BA6=\"\",\"\",IF(AZ6>BA6,\"w\",IF(AZ6=BA6,\"g\",\"v\")))","v":""},{"$f":"IF(ISBLANK(VLOOKUP(TEXT($B6,)&\" - \"&TEXT($BC$5,),SchemaED,2,0)),\"\",VLOOKUP(TEXT($B6,)&\" - \"&TEXT($BC$5,),SchemaED,2,0))","v":""},{"$f":"IF(ISBLANK(VLOOKUP(TEXT($B6,)&\" - \"&TEXT($BC$5,),SchemaED,3,0)),\"\",VLOOKUP(TEXT($B6,)&\" - \"&TEXT($BC$5,),SchemaED,3,0))","v":""},{"$f":"IF(BD6=\"\",\"\",IF(BC6>BD6,\"w\",IF(BC6=BD6,\"g\",\"v\")))","v":""},{"$f":"COUNTIF(F6:BE6,\"w\")","v":1},{"$f":"COUNTIF(F6:BE6,\"g\")","v":0},{"$f":"COUNTIF(F6:BE6,\"v\")","v":0},{"$f":"SUM(D6,G6,J6,M6,P6,S6,V6,Y6,AB6,AE6,AH6,AK6,AN6,AQ6,AT6,AW6,AZ6,BC6)","v":4},{"$f":"SUM(E6,H6,K6,N6,Q6,T6,W6,Z6,AC6,AF6,AI6,AL6,AO6,AR6,AU6,AX6,BA6,BD6)","v":0},null,{"$f":"RANK(BW6,$BW$6:$BW$23)","v":1},"PSV",{"$f":"SUM(BO6:BQ6)","v":3},{"$f":"INDEX($BF$6:$BF$23,MATCH(BM6,$B$6:$B$23,0))+INDEX($D$25:$BD$25,MATCH(BM6,$D$5:$BD$5,0))","v":3},{"$f":"INDEX($BG$6:$BG$23,MATCH(BM6,$B$6:$B$23,0))+INDEX($D$26:$BD$26,MATCH(BM6,$D$5:$BD$5,0))","v":0},{"$f":"INDEX($BH$6:$BH$23,MATCH(BM6,$B$6:$B$23,0))+INDEX($D$27:$BD$27,MATCH(BM6,$D$5:$BD$5,0))","v":0},null,{"$f":"(BO6*3)+BP6+BR6","v":9},{"$f":"BU6-BV6","v":6},{"$f":"INDEX($BI$6:$BI$23,MATCH(BM6,$B$6:$B$23,0))+INDEX($D$28:$BD$28,MATCH(BM6,$D$5:$BD$5,0))","v":8},{"$f":"INDEX($BJ$6:$BJ$23,MATCH(BM6,$B$6:$B$23,0))+INDEX($D$29:$BD$29,MATCH(BM6,$D$5:$BD$5,0))","v":2},{"$f":"VALUE(TEXT(BS6,\"000\")&TEXT(100+BT6,\"000\")&TEXT(BU6,\"000\")&TEXT(100-BN6,\"00\")&TEXT(COUNTIF($BM$6:$BM$23,\">=\"&BM6),\"00\"))","v":91060089706},null,{"$f":"IFERROR(INDEX($BL$6:$BL$25,MATCH(BZ6,$BM$6:$BM$25,0)),\"\")","v":""}]
[null,{"$f":"BM7","v":"AZ Alkmaar"},null,{"$f":"IF(ISBLANK(VLOOKUP(TEXT($B7,)&\" - \"&TEXT($D$5,),SchemaED,2,0)),\"\",VLOOKUP(TEXT($B7,)&\" - \"&TEXT($D$5,),SchemaED,2,0))","v":""},{"$f":"IF(ISBLANK(VLOOKUP(TEXT($B7,)&\" - \"&TEXT($D$5,),SchemaED,3,0)),\"\",VLOOKUP(TEXT($B7,)&\" - \"&TEXT($D$5,),SchemaED,3,0))","v":""},{"$f":"IF(E7=\"\",\"\",IF(D7>E7,\"w\",IF(D7=E7,\"g\",\"v\")))","v":""},null,null,null,{"$f":"IF(ISBLANK(VLOOKUP(TEXT($B7,)&\" - \"&TEXT($J$5,),SchemaED,2,0)),\"\",VLOOKUP(TEXT($B7,)&\" - \"&TEXT($J$5,),SchemaED,2,0))","v":""},{"$f":"IF(ISBLANK(VLOOKUP(TEXT($B7,)&\" - \"&TEXT($J$5,),SchemaED,3,0)),\"\",VLOOKUP(TEXT($B7,)&\" - \"&TEXT($J$5,),SchemaED,3,0))","v":""},"",{"$f":"IF(ISBLANK(VLOOKUP(TEXT($B7,)&\" - \"&TEXT($M$5,),SchemaED,2,0)),\"\",VLOOKUP(TEXT($B7,)&\" - \"&TEXT($M$5,),SchemaED,2,0))","v":""},{"$f":"IF(ISBLANK(VLOOKUP(TEXT($B7,)&\" - \"&TEXT($M$5,),SchemaED,3,0)),\"\",VLOOKUP(TEXT($B7,)&\" - \"&TEXT($M$5,),SchemaED,3,0))","v":""},"",{"$f":"IF(ISBLANK(VLOOKUP(TEXT($B7,)&\" - \"&TEXT($P$5,),SchemaED,2,0)),\"\",VLOOKUP(TEXT($B7,)&\" - \"&TEXT($P$5,),SchemaED,2,0))","v":""},{"$f":"IF(ISBLANK(VLOOKUP(TEXT($B7,)&\" - \"&TEXT($P$5,),SchemaED,3,0)),\"\",VLOOKUP(TEXT($B7,)&\" - \"&TEXT($P$5,),SchemaED,3,0))","v":""},"",{"$f":"IF(ISBLANK(VLOOKUP(TEXT($B7,)&\" - \"&TEXT($S$5,),SchemaED,2,0)),\"\",VLOOKUP(TEXT($B7,)&\" - \"&TEXT($S$5,),SchemaED,2,0))","v":0},{"$f":"IF(ISBLANK(VLOOKUP(TEXT($B7,)&\" - \"&TEXT($S$5,),SchemaED,3,0)),\"\",VLOOKUP(TEXT($B7,)&\" - \"&TEXT($S$5,),SchemaED,3,0))","v":0},"g","","","","","","","","","","","","","","","","","","","","","",5,0,"w","","","","","","","","","","","","",1,1,0,{"$f":"SUM(D7,G7,J7,M7,P7,S7,V7,Y7,AB7,AE7,AH7,AK7,AN7,AQ7,AT7,AW7,AZ7,BC7)","v":5},{"$f":"SUM(E7,H7,K7,N7,Q7,T7,W7,Z7,AC7,AF7,AI7,AL7,AO7,AR7,AU7,AX7,BA7,BD7)","v":0},null,2,"AZ Alkmaar",3,2,1,0,null,7,8,9,1,71080099716]
[null,{"$f":"BM8","v":"AFC Ajax"},null,"","","",{"$f":"IF(ISBLANK(VLOOKUP(TEXT($B8,)&\" - \"&TEXT($G$5,),SchemaED,2,0)),\"\",VLOOKUP(TEXT($B8,)&\" - \"&TEXT($G$5,),SchemaED,2,0))","v":""},{"$f":"IF(ISBLANK(VLOOKUP(TEXT($B8,)&\" - \"&TEXT($G$5,),SchemaED,3,0)),\"\",VLOOKUP(TEXT($B8,)&\" - \"&TEXT($G$5,),SchemaED,3,0))","v":""},"",null,null,null,{"$f":"IF(ISBLANK(VLOOKUP(TEXT($B8,)&\" - \"&TEXT($M$5,),SchemaED,2,0)),\"\",VLOOKUP(TEXT($B8,)&\" - \"&TEXT($M$5,),SchemaED,2,0))","v":""},{"$f":"IF(ISBLANK(VLOOKUP(TEXT($B8,)&\" - \"&TEXT($M$5,),SchemaED,3,0)),\"\",VLOOKUP(TEXT($B8,)&\" - \"&TEXT($M$5,),SchemaED,3,0))","v":""},"",{"$f":"IF(ISBLANK(VLOOKUP(TEXT($B8,)&\" - \"&TEXT($P$5,),SchemaED,2,0)),\"\",VLOOKUP(TEXT($B8,)&\" - \"&TEXT($P$5,),SchemaED,2,0))","v":""},{"$f":"IF(ISBLANK(VLOOKUP(TEXT($B8,)&\" - \"&TEXT($P$5,),SchemaED,3,0)),\"\",VLOOKUP(TEXT($B8,)&\" - \"&TEXT($P$5,),SchemaED,3,0))","v":""},"",{"$f":"IF(ISBLANK(VLOOKUP(TEXT($B8,)&\" - \"&TEXT($S$5,),SchemaED,2,0)),\"\",VLOOKUP(TEXT($B8,)&\" - \"&TEXT($S$5,),SchemaED,2,0))","v":""},{"$f":"IF(ISBLANK(VLOOKUP(TEXT($B8,)&\" - \"&TEXT($S$5,),SchemaED,3,0)),\"\",VLOOKUP(TEXT($B8,)&\" - \"&TEXT($S$5,),SchemaED,3,0))","v":""},"","","","","","","","","","","","","",1,1,"g","","","","","","","","","","","","",5,0,"w","","","","","","",1,1,0,6,1,null,3,"AFC Ajax",3,2,1,0,null,7,6,7,1,71060079717,null,{"$f":"IFERROR(INDEX($BL$6:$BL$25,MATCH(BZ8,$BM$6:$BM$25,0)),\"\")","v":1},{"$f":"IF(ISNA(VLOOKUP($BM$6,$BZ$6:$BZ$7,1,0)),$BM$6,IF(ISNA(VLOOKUP($BM$7,$BZ$6:$BZ$7,1,0)),$BM$7,\"\"))","v":"PSV"}]
[null,"Willem II",null,"","","","","","",{"$f":"IF(ISBLANK(VLOOKUP(TEXT($B9,)&\" - \"&TEXT($J$5,),SchemaED,2,0)),\"\",VLOOKUP(TEXT($B9,)&\" - \"&TEXT($J$5,),SchemaED,2,0))","v":""},{"$f":"IF(ISBLANK(VLOOKUP(TEXT($B9,)&\" - \"&TEXT($J$5,),SchemaED,3,0)),\"\",VLOOKUP(TEXT($B9,)&\" - \"&TEXT($J$5,),SchemaED,3,0))","v":""},"",null,null,null,{"$f":"IF(ISBLANK(VLOOKUP(TEXT($B9,)&\" - \"&TEXT($P$5,),SchemaED,2,0)),\"\",VLOOKUP(TEXT($B9,)&\" - \"&TEXT($P$5,),SchemaED,2,0))","v":""},{"$f":"IF(ISBLANK(VLOOKUP(TEXT($B9,)&\" - \"&TEXT($P$5,),SchemaED,3,0)),\"\",VLOOKUP(TEXT($B9,)&\" - \"&TEXT($P$5,),SchemaED,3,0))","v":""},"",{"$f":"IF(ISBLANK(VLOOKUP(TEXT($B9,)&\" - \"&TEXT($S$5,),SchemaED,2,0)),\"\",VLOOKUP(TEXT($B9,)&\" - \"&TEXT($S$5,),SchemaED,2,0))","v":""},{"$f":"IF(ISBLANK(VLOOKUP(TEXT($B9,)&\" - \"&TEXT($S$5,),SchemaED,3,0)),\"\",VLOOKUP(TEXT($B9,)&\" - \"&TEXT($S$5,),SchemaED,3,0))","v":""},"",0,1,"v","","","","","","","","","",5,0,"w","","","","","","","","","","","","","","","","","","","","","",1,0,1,5,1,null,4,"Willem II",3,2,0,1,null,6,5,6,1,61050069701,null,{"$f":"IFERROR(INDEX($BL$6:$BL$25,MATCH(BZ9,$BM$6:$BM$25,0)),\"\")","v":2},{"$f":"IF(ISNA(VLOOKUP($BM$7,$BZ$6:$BZ$8,1,0)),$BM$7,IF(ISNA(VLOOKUP($BM$8,$BZ$6:$BZ$8,1,0)),$BM$8,\"\"))","v":"AZ Alkmaar"}]
[null,"Feyenoord",null,"","","","","","","","","",{"$f":"IF(ISBLANK(VLOOKUP(TEXT($B10,)&\" - \"&TEXT($M$5,),SchemaED,2,0)),\"\",VLOOKUP(TEXT($B10,)&\" - \"&TEXT($M$5,),SchemaED,2,0))","v":""},{"$f":"IF(ISBLANK(VLOOKUP(TEXT($B10,)&\" - \"&TEXT($M$5,),SchemaED,3,0)),\"\",VLOOKUP(TEXT($B10,)&\" - \"&TEXT($M$5,),SchemaED,3,0))","v":""},"",null,null,null,{"$f":"IF(ISBLANK(VLOOKUP(TEXT($B10,)&\" - \"&TEXT($S$5,),SchemaED,2,0)),\"\",VLOOKUP(TEXT($B10,)&\" - \"&TEXT($S$5,),SchemaED,2,0))","v":""},{"$f":"IF(ISBLANK(VLOOKUP(TEXT($B10,)&\" - \"&TEXT($S$5,),SchemaED,3,0)),\"\",VLOOKUP(TEXT($B10,)&\" - \"&TEXT($S$5,),SchemaED,3,0))","v":""},"","","","","","","",3,0,"w","","","","","","","","","","","","","","","","","","","","","","","","","","","",1,0,0,3,0,null,5,"Feyenoord",3,2,0,1,null,6,3,8,5,61030089711,null,{"$f":"IFERROR(INDEX($BL$6:$BL$25,MATCH(BZ10,$BM$6:$BM$25,0)),\"\")","v":3},{"$f":"IF(ISNA(VLOOKUP($BM$8,$BZ$6:$BZ$9,1,0)),$BM$8,IF(ISNA(VLOOKUP($BM$9,$BZ$6:$BZ$9,1,0)),$BM$9,\"\"))","v":"AFC Ajax"}]
[null,"Vitesse",null,"","","","","","","","","","","","",{"$f":"IF(ISBLANK(VLOOKUP(TEXT($B11,)&\" - \"&TEXT($P$5,),SchemaED,2,0)),\"\",VLOOKUP(TEXT($B11,)&\" - \"&TEXT($P$5,),SchemaED,2,0))","v":""},{"$f":"IF(ISBLANK(VLOOKUP(TEXT($B11,)&\" - \"&TEXT($P$5,),SchemaED,3,0)),\"\",VLOOKUP(TEXT($B11,)&\" - \"&TEXT($P$5,),SchemaED,3,0))","v":""},"",null,null,null,"","","","","","","","","","","","","","","","","","","","","","","","",5,1,"w","","","","","","","","","",1,0,0,5,1,null,6,"Vitesse",3,1,2,0,null,5,4,6,2,51040069703]
[null,"VVV-Venlo",null,"","","","","","",0,1,"v","","","","","","",{"$f":"IF(ISBLANK(VLOOKUP(TEXT($B12,)&\" - \"&TEXT($S$5,),SchemaED,2,0)),\"\",VLOOKUP(TEXT($B12,)&\" - \"&TEXT($S$5,),SchemaED,2,0))","v":""},{"$f":"IF(ISBLANK(VLOOKUP(TEXT($B12,)&\" - \"&TEXT($S$5,),SchemaED,3,0)),\"\",VLOOKUP(TEXT($B12,)&\" - \"&TEXT($S$5,),SchemaED,3,0))","v":""},"",null,null,null,"","","","","","","","","","","","","","","","","","","","","","","","","","","","","","","","","",0,0,1,0,1,null,7,"VVV-Venlo",3,1,1,1,null,4,0,2,2,41000029702,null,{"$f":"IFERROR(INDEX($BL$6:$BL$25,MATCH(BZ12,$BM$6:$BM$25,0)),\"\")","v":""}]
[null,"sc Heerenveen",null,"","","","","","","","","","","","",3,5,"v",1,1,"g",{"$f":"IF(ISBLANK(VLOOKUP(TEXT($B13,)&\" - \"&TEXT($V$5,),SchemaED,2,0)),\"\",VLOOKUP(TEXT($B13,)&\" - \"&TEXT($V$5,),SchemaED,2,0))","v":""},{"$f":"IF(ISBLANK(VLOOKUP(TEXT($B13,)&\" - \"&TEXT($V$5,),SchemaED,3,0)),\"\",VLOOKUP(TEXT($B13,)&\" - \"&TEXT($V$5,),SchemaED,3,0))","v":""},"",null,null,null,"","","","","","","","","","","","","","","","","","","","","","","","","","","","","","",0,1,1,4,6,null,8,"sc Heerenveen",3,1,1,1,null,4,-1,7,8,40990079704]
[null,"SBV Excelsior",null,"","","","","","","","","","","","","","","","","","","","","",{"$f":"IF(ISBLANK(VLOOKUP(TEXT($B14,)&\" - \"&TEXT($Y$5,),SchemaED,2,0)),\"\",VLOOKUP(TEXT($B14,)&\" - \"&TEXT($Y$5,),SchemaED,2,0))","v":""},{"$f":"IF(ISBLANK(VLOOKUP(TEXT($B14,)&\" - \"&TEXT($Y$5,),SchemaED,3,0)),\"\",VLOOKUP(TEXT($B14,)&\" - \"&TEXT($Y$5,),SchemaED,3,0))","v":""},"",null,null,null,"","","","","","","","","","","","","","","","","","","","","",1,1,"g","","","",0,1,0,1,1,null,9,"SBV Excelsior",3,1,1,1,null,4,-1,3,4,40990039705,null,{"$f":"INDEX($BL$6:$BL$25,MATCH(BZ14,$BM$6:$BM$25,0))","v":4},{"$f":"IF(ISNA(VLOOKUP($BM$6,$BZ$6:$BZ$13,1,0)),$BM$6,IF(ISNA(VLOOKUP($BM$7,$BZ$6:$BZ$13,1,0)),$BM$7,IF(ISNA(VLOOKUP($BM$8,$BZ$6:$BZ$13,1,0)),$BM$8,IF(ISNA(VLOOKUP($BM$9,$BZ$6:$BZ$13,1,0)),$BM$9,IF(ISNA(VLOOKUP($BM$10,$BZ$6:$BZ$13,1,0)),$BM$10,IF(ISNA(VLOOKUP($BM$11,$BZ$6:$BZ$13,1,0)),$BM$11,IF(ISNA(VLOOKUP($BM$12,$BZ$6:$BZ$13,1,0)),$BM$12,IF(ISNA(VLOOKUP($BM$13,$BZ$6:$BZ$13,1,0)),$BM$13,IF(ISNA(VLOOKUP($BM$14,$BZ$6:$BZ$13,1,0)),$BM$14,IF(ISNA(VLOOKUP($BM$15,$BZ$6:$BZ$13,1,0)),$BM$15))))))))))","v":"Willem II"}]
[null,"FC Utrecht",null,"","","","","","","","","","","","","","","","","","",1,1,"g","","","",{"$f":"IF(ISBLANK(VLOOKUP(TEXT($B15,)&\" - \"&TEXT($AB$5,),SchemaED,2,0)),\"\",VLOOKUP(TEXT($B15,)&\" - \"&TEXT($AB$5,),SchemaED,2,0))","v":""},{"$f":"IF(ISBLANK(VLOOKUP(TEXT($B15,)&\" - \"&TEXT($AB$5,),SchemaED,3,0)),\"\",VLOOKUP(TEXT($B15,)&\" - \"&TEXT($AB$5,),SchemaED,3,0))","v":""},"",null,null,null,"","","","","","","","","","","","","","","","","","","","","",2,0,"w",1,1,0,3,1,null,10,"FC Utrecht",3,1,1,1,null,4,-2,3,5,40980039712,null,5,{"$f":"IF(ISNA(VLOOKUP($BM$6,$BZ$6:$BZ$14,1,0)),$BM$6,IF(ISNA(VLOOKUP($BM$7,$BZ$6:$BZ$14,1,0)),$BM$7,IF(ISNA(VLOOKUP($BM$8,$BZ$6:$BZ$14,1,0)),$BM$8,IF(ISNA(VLOOKUP($BM$9,$BZ$6:$BZ$14,1,0)),$BM$9,IF(ISNA(VLOOKUP($BM$10,$BZ$6:$BZ$14,1,0)),$BM$10,IF(ISNA(VLOOKUP($BM$11,$BZ$6:$BZ$14,1,0)),$BM$11,IF(ISNA(VLOOKUP($BM$12,$BZ$6:$BZ$14,1,0)),$BM$12,IF(ISNA(VLOOKUP($BM$13,$BZ$6:$BZ$14,1,0)),$BM$13,IF(ISNA(VLOOKUP($BM$14,$BZ$6:$BZ$14,1,0)),$BM$14,IF(ISNA(VLOOKUP($BM$15,$BZ$6:$BZ$14,1,0)),$BM$15))))))))))","v":"Feyenoord"}]
[null,"Heracles Almelo",null,"","","","","","","","","","","","","","","","","","","","","","","","","","","",{"$f":"IF(ISBLANK(VLOOKUP(TEXT($B16,)&\" - \"&TEXT($AE$5,),SchemaED,2,0)),\"\",VLOOKUP(TEXT($B16,)&\" - \"&TEXT($AE$5,),SchemaED,2,0))","v":""},{"$f":"IF(ISBLANK(VLOOKUP(TEXT($B16,)&\" - \"&TEXT($AE$5,),SchemaED,3,0)),\"\",VLOOKUP(TEXT($B16,)&\" - \"&TEXT($AE$5,),SchemaED,3,0))","v":""},"",null,null,null,4,2,"w","","","","","","","","","","","","","","","","","","",1,0,0,4,2,null,11,"Heracles Almelo",3,1,1,1,null,4,-3,5,8,40970059709,null,6,{"$f":"IF(ISNA(VLOOKUP($BM$6,$BZ$6:$BZ$15,1,0)),$BM$6,IF(ISNA(VLOOKUP($BM$7,$BZ$6:$BZ$15,1,0)),$BM$7,IF(ISNA(VLOOKUP($BM$8,$BZ$6:$BZ$15,1,0)),$BM$8,IF(ISNA(VLOOKUP($BM$9,$BZ$6:$BZ$15,1,0)),$BM$9,IF(ISNA(VLOOKUP($BM$10,$BZ$6:$BZ$15,1,0)),$BM$10,IF(ISNA(VLOOKUP($BM$11,$BZ$6:$BZ$15,1,0)),$BM$11,IF(ISNA(VLOOKUP($BM$12,$BZ$6:$BZ$15,1,0)),$BM$12,IF(ISNA(VLOOKUP($BM$13,$BZ$6:$BZ$15,1,0)),$BM$13,IF(ISNA(VLOOKUP($BM$14,$BZ$6:$BZ$15,1,0)),BM$14,IF(ISNA(VLOOKUP($BM$15,$BZ$6:$BZ$15,1,0)),$BM$15))))))))))","v":"Vitesse"}]
[null,"ADO Den Haag",null,"","","","","","","","","","","","","","","","","","","","","","","","","","","","","","",{"$f":"IF(ISBLANK(VLOOKUP(TEXT($B17,)&\" - \"&TEXT($AH$5,),SchemaED,2,0)),\"\",VLOOKUP(TEXT($B17,)&\" - \"&TEXT($AH$5,),SchemaED,2,0))","v":""},{"$f":"IF(ISBLANK(VLOOKUP(TEXT($B17,)&\" - \"&TEXT($AH$5,),SchemaED,3,0)),\"\",VLOOKUP(TEXT($B17,)&\" - \"&TEXT($AH$5,),SchemaED,3,0))","v":""},"",null,null,null,"","","","","","","","","",1,2,"v",3,1,"w","","","",1,0,1,4,3,null,12,"ADO Den Haag",3,1,0,2,null,3,-1,6,7,30990069718,null,7,{"$f":"IF(ISNA(VLOOKUP($BM$6,$BZ$6:$BZ$16,1,0)),$BM$6,IF(ISNA(VLOOKUP($BM$7,$BZ$6:$BZ$16,1,0)),$BM$7,IF(ISNA(VLOOKUP($BM$8,$BZ$6:$BZ$16,1,0)),$BM$8,IF(ISNA(VLOOKUP($BM$9,$BZ$6:$BZ$16,1,0)),$BM$9,IF(ISNA(VLOOKUP($BM$10,$BZ$6:$BZ$16,1,0)),$BM$10,IF(ISNA(VLOOKUP($BM$11,$BZ$6:$BZ$16,1,0)),$BM$11,IF(ISNA(VLOOKUP($BM$12,$BZ$6:$BZ$16,1,0)),$BM$12,IF(ISNA(VLOOKUP($BM$13,$BZ$6:$BZ$16,1,0)),$BM$13,IF(ISNA(VLOOKUP($BM$14,$BZ$6:$BZ$16,1,0)),BM$14,IF(ISNA(VLOOKUP($BM$16,$BZ$6:$BZ$15,1,0)),$BM$16))))))))))","v":"VVV-Venlo"}]
[null,"De Graafschap",null,"","","","","","","","","","","","",2,0,"w","","","","","","","","","","","","","","","","","","",{"$f":"IF(ISBLANK(VLOOKUP(TEXT($B18,)&\" - \"&TEXT($AK$5,),SchemaED,2,0)),\"\",VLOOKUP(TEXT($B18,)&\" - \"&TEXT($AK$5,),SchemaED,2,0))","v":""},{"$f":"IF(ISBLANK(VLOOKUP(TEXT($B18,)&\" - \"&TEXT($AK$5,),SchemaED,3,0)),\"\",VLOOKUP(TEXT($B18,)&\" - \"&TEXT($AK$5,),SchemaED,3,0))","v":""},"",null,null,null,"","","",0,1,"v","","","","","","","","","",1,0,1,2,1,null,13,"De Graafschap",3,1,0,2,null,3,-2,2,4,30980029715]
[null,"NAC Breda",null,"","","","","","","","","","","","","","","","","","","","","","","","",0,2,"v","","","","","","","","","",{"$f":"IF(ISBLANK(VLOOKUP(TEXT($B19,)&\" - \"&TEXT($AN$5,),SchemaED,2,0)),\"\",VLOOKUP(TEXT($B19,)&\" - \"&TEXT($AN$5,),SchemaED,2,0))","v":3},{"$f":"IF(ISBLANK(VLOOKUP(TEXT($B19,)&\" - \"&TEXT($AN$5,),SchemaED,3,0)),\"\",VLOOKUP(TEXT($B19,)&\" - \"&TEXT($AN$5,),SchemaED,3,0))","v":0},"w",null,null,null,"","","","","","","","","","","","",1,0,1,3,2,null,14,"NAC Breda",3,1,0,2,null,3,-4,3,7,30960039708]
[null,"FC Groningen",null,"","","","","","","","","",0,1,"v","","","","","","","","","","","","","","","","","","","","","","","","",{"$f":"IF(ISBLANK(VLOOKUP(TEXT($B20,)&\" - \"&TEXT($AN$5,),SchemaED,2,0)),\"\",VLOOKUP(TEXT($B20,)&\" - \"&TEXT($AN$5,),SchemaED,2,0))","v":""},{"$f":"IF(ISBLANK(VLOOKUP(TEXT($B20,)&\" - \"&TEXT($AN$5,),SchemaED,3,0)),\"\",VLOOKUP(TEXT($B20,)&\" - \"&TEXT($AN$5,),SchemaED,3,0))","v":""},"",{"$f":"IF(ISBLANK(VLOOKUP(TEXT($B20,)&\" - \"&TEXT($AQ$5,),SchemaED,2,0)),\"\",VLOOKUP(TEXT($B20,)&\" - \"&TEXT($AQ$5,),SchemaED,2,0))","v":""},{"$f":"IF(ISBLANK(VLOOKUP(TEXT($B20,)&\" - \"&TEXT($AQ$5,),SchemaED,3,0)),\"\",VLOOKUP(TEXT($B20,)&\" - \"&TEXT($AQ$5,),SchemaED,3,0))","v":""},"",null,null,null,"","","","","","","","","",0,0,1,0,1,null,15,"FC Groningen",3,1,0,2,null,3,-4,2,6,30960029713]
[null,"FC Emmen",null,"","","",1,4,"v","","","","","","","","","","","","","","","","","","","","","","","","","","","","","","",{"$f":"IF(ISBLANK(VLOOKUP(TEXT($B21,)&\" - \"&TEXT($AN$5,),SchemaED,2,0)),\"\",VLOOKUP(TEXT($B21,)&\" - \"&TEXT($AN$5,),SchemaED,2,0))","v":""},{"$f":"IF(ISBLANK(VLOOKUP(TEXT($B21,)&\" - \"&TEXT($AN$5,),SchemaED,3,0)),\"\",VLOOKUP(TEXT($B21,)&\" - \"&TEXT($AN$5,),SchemaED,3,0))","v":""},"",{"$f":"IF(ISBLANK(VLOOKUP(TEXT($B21,)&\" - \"&TEXT($AQ$5,),SchemaED,2,0)),\"\",VLOOKUP(TEXT($B21,)&\" - \"&TEXT($AQ$5,),SchemaED,2,0))","v":""},{"$f":"IF(ISBLANK(VLOOKUP(TEXT($B21,)&\" - \"&TEXT($AQ$5,),SchemaED,3,0)),\"\",VLOOKUP(TEXT($B21,)&\" - \"&TEXT($AQ$5,),SchemaED,3,0))","v":""},"",{"$f":"IF(ISBLANK(VLOOKUP(TEXT($B21,)&\" - \"&TEXT($AT$5,),SchemaED,2,0)),\"\",VLOOKUP(TEXT($B21,)&\" - \"&TEXT($AT$5,),SchemaED,2,0))","v":""},{"$f":"IF(ISBLANK(VLOOKUP(TEXT($B21,)&\" - \"&TEXT($AT$5,),SchemaED,3,0)),\"\",VLOOKUP(TEXT($B21,)&\" - \"&TEXT($AT$5,),SchemaED,3,0))","v":""},"",null,null,null,"","","","","","",0,0,1,1,4,null,16,"FC Emmen",3,1,0,2,null,3,-7,3,10,30930039714]
[null,"Fortuna Sittard",null,1,2,"v","","","","","","","","","","","","","","","","","","","","","","","","","","","","","","","","","",{"$f":"IF(ISBLANK(VLOOKUP(TEXT($B22,)&\" - \"&TEXT($AN$5,),SchemaED,2,0)),\"\",VLOOKUP(TEXT($B22,)&\" - \"&TEXT($AN$5,),SchemaED,2,0))","v":""},{"$f":"IF(ISBLANK(VLOOKUP(TEXT($B22,)&\" - \"&TEXT($AN$5,),SchemaED,3,0)),\"\",VLOOKUP(TEXT($B22,)&\" - \"&TEXT($AN$5,),SchemaED,3,0))","v":""},"",{"$f":"IF(ISBLANK(VLOOKUP(TEXT($B22,)&\" - \"&TEXT($AQ$5,),SchemaED,2,0)),\"\",VLOOKUP(TEXT($B22,)&\" - \"&TEXT($AQ$5,),SchemaED,2,0))","v":""},{"$f":"IF(ISBLANK(VLOOKUP(TEXT($B22,)&\" - \"&TEXT($AQ$5,),SchemaED,3,0)),\"\",VLOOKUP(TEXT($B22,)&\" - \"&TEXT($AQ$5,),SchemaED,3,0))","v":""},"",{"$f":"IF(ISBLANK(VLOOKUP(TEXT($B22,)&\" - \"&TEXT($AT$5,),SchemaED,2,0)),\"\",VLOOKUP(TEXT($B22,)&\" - \"&TEXT($AT$5,),SchemaED,2,0))","v":""},{"$f":"IF(ISBLANK(VLOOKUP(TEXT($B22,)&\" - \"&TEXT($AT$5,),SchemaED,3,0)),\"\",VLOOKUP(TEXT($B22,)&\" - \"&TEXT($AT$5,),SchemaED,3,0))","v":""},"",{"$f":"IF(ISBLANK(VLOOKUP(TEXT($B22,)&\" - \"&TEXT($AW$5,),SchemaED,2,0)),\"\",VLOOKUP(TEXT($B22,)&\" - \"&TEXT($AW$5,),SchemaED,2,0))","v":""},{"$f":"IF(ISBLANK(VLOOKUP(TEXT($B22,)&\" - \"&TEXT($AW$5,),SchemaED,3,0)),\"\",VLOOKUP(TEXT($B22,)&\" - \"&TEXT($AW$5,),SchemaED,3,0))","v":""},"",null,null,null,"","","",0,0,1,1,2,null,17,"Fortuna Sittard",3,0,1,2,null,1,-3,3,6,10970039710]
[null,"PEC Zwolle",null,1,2,"v","","","","","","","","","","","","","","","","","","",2,3,"v","","","","","","","","","","","","",{"$f":"IF(ISBLANK(VLOOKUP(TEXT($B23,)&\" - \"&TEXT($AN$5,),SchemaED,2,0)),\"\",VLOOKUP(TEXT($B23,)&\" - \"&TEXT($AN$5,),SchemaED,2,0))","v":""},{"$f":"IF(ISBLANK(VLOOKUP(TEXT($B23,)&\" - \"&TEXT($AN$5,),SchemaED,3,0)),\"\",VLOOKUP(TEXT($B23,)&\" - \"&TEXT($AN$5,),SchemaED,3,0))","v":""},"",{"$f":"IF(ISBLANK(VLOOKUP(TEXT($B23,)&\" - \"&TEXT($AQ$5,),SchemaED,2,0)),\"\",VLOOKUP(TEXT($B23,)&\" - \"&TEXT($AQ$5,),SchemaED,2,0))","v":""},{"$f":"IF(ISBLANK(VLOOKUP(TEXT($B23,)&\" - \"&TEXT($AQ$5,),SchemaED,3,0)),\"\",VLOOKUP(TEXT($B23,)&\" - \"&TEXT($AQ$5,),SchemaED,3,0))","v":""},"",{"$f":"IF(ISBLANK(VLOOKUP(TEXT($B23,)&\" - \"&TEXT($AT$5,),SchemaED,2,0)),\"\",VLOOKUP(TEXT($B23,)&\" - \"&TEXT($AT$5,),SchemaED,2,0))","v":""},{"$f":"IF(ISBLANK(VLOOKUP(TEXT($B23,)&\" - \"&TEXT($AT$5,),SchemaED,3,0)),\"\",VLOOKUP(TEXT($B23,)&\" - \"&TEXT($AT$5,),SchemaED,3,0))","v":""},"",{"$f":"IF(ISBLANK(VLOOKUP(TEXT($B23,)&\" - \"&TEXT($AW$5,),SchemaED,2,0)),\"\",VLOOKUP(TEXT($B23,)&\" - \"&TEXT($AW$5,),SchemaED,2,0))","v":""},{"$f":"IF(ISBLANK(VLOOKUP(TEXT($B23,)&\" - \"&TEXT($AW$5,),SchemaED,3,0)),\"\",VLOOKUP(TEXT($B23,)&\" - \"&TEXT($AW$5,),SchemaED,3,0))","v":""},"",{"$f":"IF(ISBLANK(VLOOKUP(TEXT($B23,)&\" - \"&TEXT($AZ$5,),SchemaED,2,0)),\"\",VLOOKUP(TEXT($B23,)&\" - \"&TEXT($AZ$5,),SchemaED,2,0))","v":""},{"$f":"IF(ISBLANK(VLOOKUP(TEXT($B23,)&\" - \"&TEXT($AZ$5,),SchemaED,3,0)),\"\",VLOOKUP(TEXT($B23,)&\" - \"&TEXT($AZ$5,),SchemaED,3,0))","v":""},"",null,null,null,0,0,2,3,5,null,18,"PEC Zwolle",3,0,0,3,null,0,-4,3,7,960039707]
[]
[null,"Winst uit",null,{"$f":"COUNTIF(F$6:F$23,\"v\")","v":2},null,null,{"$f":"COUNTIF(I$6:I$23,\"v\")","v":1},null,null,{"$f":"COUNTIF(L$6:L$23,\"v\")","v":1},null,null,{"$f":"COUNTIF(O$6:O$23,\"v\")","v":1},null,null,{"$f":"COUNTIF(R$6:R$23,\"v\")","v":1},null,null,{"$f":"COUNTIF(U$6:U$23,\"v\")","v":0},null,null,{"$f":"COUNTIF(X$6:X$23,\"v\")","v":1},null,null,{"$f":"COUNTIF(AA$6:AA$23,\"v\")","v":1},null,null,{"$f":"COUNTIF(AD$6:AD$23,\"v\")","v":1},null,null,{"$f":"COUNTIF(AG$6:AG$23,\"v\")","v":0},null,null,{"$f":"COUNTIF(AJ$6:AJ$23,\"v\")","v":0},null,null,{"$f":"COUNTIF(AM$6:AM$23,\"v\")","v":0},null,null,{"$f":"COUNTIF(AP$6:AP$23,\"v\")","v":0},null,null,{"$f":"COUNTIF(AS$6:AS$23,\"v\")","v":0},null,null,{"$f":"COUNTIF(AV$6:AV$23,\"v\")","v":1},null,null,{"$f":"COUNTIF(AY$6:AY$23,\"v\")","v":1},null,null,{"$f":"COUNTIF(BB$6:BB$23,\"v\")","v":0},null,null,{"$f":"COUNTIF(BE$6:BE$23,\"v\")","v":0},null,null,null,null,null,null,null,null,null," Champions League groepsfase"]
[null,"Gelijk uit",null,{"$f":"COUNTIF(F$6:F$23,\"g\")","v":0},null,null,{"$f":"COUNTIF(I$6:I$23,\"g\")","v":0},null,null,{"$f":"COUNTIF(L$6:L$23,\"g\")","v":0},null,null,{"$f":"COUNTIF(O$6:O$23,\"g\")","v":0},null,null,{"$f":"COUNTIF(R$6:R$23,\"g\")","v":0},null,null,{"$f":"COUNTIF(U$6:U$23,\"g\")","v":2},null,null,{"$f":"COUNTIF(X$6:X$23,\"g\")","v":1},null,null,{"$f":"COUNTIF(AA$6:AA$23,\"g\")","v":0},null,null,{"$f":"COUNTIF(AD$6:AD$23,\"g\")","v":0},null,null,{"$f":"COUNTIF(AG$6:AG$23,\"g\")","v":0},null,null,{"$f":"COUNTIF(AJ$6:AJ$23,\"g\")","v":1},null,null,{"$f":"COUNTIF(AM$6:AM$23,\"g\")","v":0},null,null,{"$f":"COUNTIF(AP$6:AP$23,\"g\")","v":0},null,null,{"$f":"COUNTIF(AS$6:AS$23,\"g\")","v":0},null,null,{"$f":"COUNTIF(AV$6:AV$23,\"g\")","v":0},null,null,{"$f":"COUNTIF(AY$6:AY$23,\"g\")","v":0},null,null,{"$f":"COUNTIF(BB$6:BB$23,\"g\")","v":1},null,null,{"$f":"COUNTIF(BE$6:BE$23,\"g\")","v":0},null,null,null,null,null,null,null,null,null," Champions League 3ᵉ voorronde"]
[null,"Verlies uit",null,{"$f":"COUNTIF(F$6:F$23,\"w\")","v":0},null,null,{"$f":"COUNTIF(I$6:I$23,\"w\")","v":0},null,null,{"$f":"COUNTIF(L$6:L$23,\"w\")","v":0},null,null,{"$f":"COUNTIF(O$6:O$23,\"w\")","v":0},null,null,{"$f":"COUNTIF(R$6:R$23,\"w\")","v":1},null,null,{"$f":"COUNTIF(U$6:U$23,\"w\")","v":0},null,null,{"$f":"COUNTIF(X$6:X$23,\"w\")","v":0},null,null,{"$f":"COUNTIF(AA$6:AA$23,\"w\")","v":0},null,null,{"$f":"COUNTIF(AD$6:AD$23,\"w\")","v":1},null,null,{"$f":"COUNTIF(AG$6:AG$23,\"w\")","v":1},null,null,{"$f":"COUNTIF(AJ$6:AJ$23,\"w\")","v":1},null,null,{"$f":"COUNTIF(AM$6:AM$23,\"w\")","v":1},null,null,{"$f":"COUNTIF(AP$6:AP$23,\"w\")","v":1},null,null,{"$f":"COUNTIF(AS$6:AS$23,\"w\")","v":1},null,null,{"$f":"COUNTIF(AV$6:AV$23,\"w\")","v":1},null,null,{"$f":"COUNTIF(AY$6:AY$23,\"w\")","v":1},null,null,{"$f":"COUNTIF(BB$6:BB$23,\"w\")","v":1},null,null,{"$f":"COUNTIF(BE$6:BE$23,\"w\")","v":1},null,null,null,null,null,null,null,null,null," Europa League 3ᵉ voorronde"]
[null,"Vóór uit",null,{"$f":"SUM(E6:E23)","v":4},null,null,{"$f":"SUM(H6:H23)","v":4},null,null,{"$f":"SUM(K6:K23)","v":1},null,null,{"$f":"SUM(N6:N23)","v":1},null,null,{"$f":"SUM(Q6:Q23)","v":5},null,null,{"$f":"SUM(T6:T23)","v":1},null,null,{"$f":"SUM(W6:W23)","v":2},null,null,{"$f":"SUM(Z6:Z23)","v":3},null,null,{"$f":"SUM(AC6:AC23)","v":2},null,null,{"$f":"SUM(AF6:AF23)","v":0},null,null,{"$f":"SUM(AI6:AI23)","v":1},null,null,{"$f":"SUM(AL6:AL23)","v":2},null,null,{"$f":"SUM(AO6:AO23)","v":0},null,null,{"$f":"SUM(AR6:AR23)","v":0},null,null,{"$f":"SUM(AU6:AU23)","v":2},null,null,{"$f":"SUM(AX6:AX23)","v":2},null,null,{"$f":"SUM(BA6:BA23)","v":2},null,null,{"$f":"SUM(BD6:BD23)","v":0},null,null,null,null,null,null,null,null,null," Europa League  Play Offs"]
[null,"Tegen uit",null,{"$f":"SUM(D6:D23)","v":2},null,null,{"$f":"SUM(G6:G23)","v":1},null,null,{"$f":"SUM(J6:J23)","v":0},null,null,{"$f":"SUM(M6:M23)","v":0},null,null,{"$f":"SUM(P6:P23)","v":5},null,null,{"$f":"SUM(S6:S23)","v":1},null,null,{"$f":"SUM(V6:V23)","v":1},null,null,{"$f":"SUM(Y6:Y23)","v":2},null,null,{"$f":"SUM(AB6:AB23)","v":3},null,null,{"$f":"SUM(AE6:AE23)","v":4},null,null,{"$f":"SUM(AH6:AH23)","v":6},null,null,{"$f":"SUM(AK6:AK23)","v":4},null,null,{"$f":"SUM(AN6:AN23)","v":3},null,null,{"$f":"SUM(AQ6:AQ23)","v":5},null,null,{"$f":"SUM(AT6:AT23)","v":5},null,null,{"$f":"SUM(AW6:AW23)","v":6},null,null,{"$f":"SUM(AZ6:AZ23)","v":4},null,null,{"$f":"SUM(BC6:BC23)","v":2},null,null,null,null,null,null,null,null,null," Degradatie Play Offs"]
[null,null,null,null,null,null,null,null,null,null,null,null,null,null,null,null,null,null,null,null,null,null,null,null,null,null,null,null,null,null,null,null,null,null,null,null,null,null,null,null,null,null,null,null,null,null,null,null,null,null,null,null,null,null,null,null,null,null,null,null,null,null,null,null," Degradatie "]

{"sheet":"KeukenKampioenDivisie","index":4,"n_rows":151,"n_cols":84,"rows_kept":151,"cut":false,"hidden":false,"merged":[[0,1,0,83]]}
[null,{"$f":"\"Competitie \"&Comp","v":"Competitie 2018-2019"}]
[]
[null,"KeukenKampioenDivisie"]
[]
[null,null,null,{"$f":"$B$6","v":"Go Ahead Eagles"},null,null,{"$f":"$B$7","v":"TOP Oss"},null,null,{"$f":"$B$8","v":"RKC Waalwijk"},null,null,{"$f":"$B$9","v":"Roda JC Kerkrade"},null,null,{"$f":"$B$10","v":"FC Twente"},null,null,{"$f":"$B$11","v":"NEC Nijmegen"},null,null,{"$f":"$B$12","v":"SC Cambuur"},null,null,{"$f":"$B$13","v":"Jong Ajax"},null,null,{"$f":"$B$14","v":"Sparta Rotterdam"},null,null,{"$f":"$B$15","v":"Almere City FC"},null,null,{"$f":"$B$16","v":"FC Den Bosch"},null,null,{"$f":"$B$17","v":"MVV Maastricht"},null,null,{"$f":"$B$18","v":"Jong PSV"},null,null,{"$f":"$B$19","v":"Helmond Sport"},null,null,{"$f":"$B$20","v":"FC Dordrecht"},null,null,{"$f":"$B$21","v":"Jong AZ Alkmaar"},null,null,{"$f":"$B$22","v":"FC Eindhoven"},null,null,{"$f":"$B$23","v":"SC Telstar"},null,null,{"$f":"$B$24","v":"FC Volendam"},null,null,{"$f":"$B$25","v":"Jong FC Utrecht"},null,null,"Winst thuis","Gelijk thuis","Verlies thuis","Vóór thuis","Tegen thuis",null,"Plaats","Team","Gespeeld","Winst","Gelijk","Verlies","Straf","Punten","Doelsaldo","Vóór","Tegen","Code",null,null,"Nacompetitie"]
[null,{"$f":"BS6","v":"Go Ahead Eagles"},null,null,null,null,{"$f":"IF(ISBLANK(VLOOKUP(TEXT($B6,)&\" - \"&TEXT($G$5,),SchemaKK,2,0)),\"\",VLOOKUP(TEXT($B6,)&\" - \"&TEXT($G$5,),SchemaKK,2,0))","v":""},{"$f":"IF(ISBLANK(VLOOKUP(TEXT($B6,)&\" - \"&TEXT($G$5,),SchemaKK,3,0)),\"\",VLOOKUP(TEXT($B6,)&\" - \"&TEXT($G$5,),SchemaKK,3,0))","v":""},{"$f":"IF(H6=\"\",\"\",IF(G6>H6,\"w\",IF(G6=H6,\"g\",\"v\")))","v":""},{"$f":"IF(ISBLANK(VLOOKUP(TEXT($B6,)&\" - \"&TEXT($J$5,),SchemaKK,2,0)),\"\",VLOOKUP(TEXT($B6,)&\" - \"&TEXT($J$5,),SchemaKK,2,0))","v":""},{"$f":"IF(ISBLANK(VLOOKUP(TEXT($B6,)&\" - \"&TEXT($J$5,),SchemaKK,3,0)),\"\",VLOOKUP(TEXT($B6,)&\" - \"&TEXT($J$5,),SchemaKK,3,0))","v":""},{"$f":"IF(K6=\"\",\"\",IF(J6>K6,\"w\",IF(J6=K6,\"g\",\"v\")))","v":""},{"$f":"IF(ISBLANK(VLOOKUP(TEXT($B6,)&\" - \"&TEXT($M$5,),SchemaKK,2,0)),\"\",VLOOKUP(TEXT($B6,)&\" - \"&TEXT($M$5,),SchemaKK,2,0))","v":""},{"$f":"IF(ISBLANK(VLOOKUP(TEXT($B6,)&\" - \"&TEXT($M$5,),SchemaKK,3,0)),\"\",VLOOKUP(TEXT($B6,)&\" - \"&TEXT($M$5,),SchemaKK,3,0))","v":""},{"$f":"IF(N6=\"\",\"\",IF(M6>N6,\"w\",IF(M6=N6,\"g\",\"v\")))","v":""},{"$f":"IF(ISBLANK(VLOOKUP(TEXT($B6,)&\" - \"&TEXT($P$5,),SchemaKK,2,0)),\"\",VLOOKUP(TEXT($B6,)&\" - \"&TEXT($P$5,),SchemaKK,2,0))","v":""},{"$f":"IF(ISBLANK(VLOOKUP(TEXT($B6,)&\" - \"&TEXT($P$5,),SchemaKK,3,0)),\"\",VLOOKUP(TEXT($B6,)&\" - \"&TEXT($P$5,),SchemaKK,3,0))","v":""},{"$f":"IF(Q6=\"\",\"\",IF(P6>Q6,\"w\",IF(P6=Q6,\"g\",\"v\")))","v":""},{"$f":"IF(ISBLANK(VLOOKUP(TEXT($B6,)&\" - \"&TEXT($S$5,),SchemaKK,2,0)),\"\",VLOOKUP(TEXT($B6,)&\" - \"&TEXT($S$5,),SchemaKK,2,0))","v":""},{"$f":"IF(ISBLANK(VLOOKUP(TEXT($B6,)&\" - \"&TEXT($S$5,),SchemaKK,3,0)),\"\",VLOOKUP(TEXT($B6,)&\" - \"&TEXT($S$5,),SchemaKK,3,0))","v":""},{"$f":"IF(T6=\"\",\"\",IF(S6>T6,\"w\",IF(S6=T6,\"g\",\"v\")))","v":""},{"$f":"IF(ISBLANK(VLOOKUP(TEXT($B6,)&\" - \"&TEXT($V$5,),SchemaKK,2,0)),\"\",VLOOKUP(TEXT($B6,)&\" - \"&TEXT($V$5,),SchemaKK,2,0))","v":""},{"$f":"IF(ISBLANK(VLOOKUP(TEXT($B6,)&\" - \"&TEXT($V$5,),SchemaKK,3,0)),\"\",VLOOKUP(TEXT($B6,)&\" - \"&TEXT($V$5,),SchemaKK,3,0))","v":""},{"$f":"IF(W6=\"\",\"\",IF(V6>W6,\"w\",IF(V6=W6,\"g\",\"v\")))","v":""},{"$f":"IF(ISBLANK(VLOOKUP(TEXT($B6,)&\" - \"&TEXT($Y$5,),SchemaKK,2,0)),\"\",VLOOKUP(TEXT($B6,)&\" - \"&TEXT($Y$5,),SchemaKK,2,0))","v":""},{"$f":"IF(ISBLANK(VLOOKUP(TEXT($B6,)&\" - \"&TEXT($Y$5,),SchemaKK,3,0)),\"\",VLOOKUP(TEXT($B6,)&\" - \"&TEXT($Y$5,),SchemaKK,3,0))","v":""},{"$f":"IF(Z6=\"\",\"\",IF(Y6>Z6,\"w\",IF(Y6=Z6,\"g\",\"v\")))","v":""},{"$f":"IF(ISBLANK(VLOOKUP(TEXT($B6,)&\" - \"&TEXT($AB$5,),SchemaKK,2,0)),\"\",VLOOKUP(TEXT($B6,)&\" - \"&TEXT($AB$5,),SchemaKK,2,0))","v":""},{"$f":"IF(ISBLANK(VLOOKUP(TEXT($B6,)&\" - \"&TEXT($AB$5,),SchemaKK,3,0)),\"\",VLOOKUP(TEXT($B6,)&\" - \"&TEXT($AB$5,),SchemaKK,3,0))","v":""},{"$f":"IF(AC6=\"\",\"\",IF(AB6>AC6,\"w\",IF(AB6=AC6,\"g\",\"v\")))","v":""},{"$f":"IF(ISBLANK(VLOOKUP(TEXT($B6,)&\" - \"&TEXT($AE$5,),SchemaKK,2,0)),\"\",VLOOKUP(TEXT($B6,)&\" - \"&TEXT($AE$5,),SchemaKK,2,0))","v":""},{"$f":"IF(ISBLANK(VLOOKUP(TEXT($B6,)&\" - \"&TEXT($AE$5,),SchemaKK,3,0)),\"\",VLOOKUP(TEXT($B6,)&\" - \"&TEXT($AE$5,),SchemaKK,3,0))","v":""},{"$f":"IF(AF6=\"\",\"\",IF(AE6>AF6,\"w\",IF(AE6=AF6,\"g\",\"v\")))","v":""},{"$f":"IF(ISBLANK(VLOOKUP(TEXT($B6,)&\" - \"&TEXT($AH$5,),SchemaKK,2,0)),\"\",VLOOKUP(TEXT($B6,)&\" - \"&TEXT($AH$5,),SchemaKK,2,0))","v":""},{"$f":"IF(ISBLANK(VLOOKUP(TEXT($B6,)&\" - \"&TEXT($AH$5,),SchemaKK,3,0)),\"\",VLOOKUP(TEXT($B6,)&\" - \"&TEXT($AH$5,),SchemaKK,3,0))","v":""},{"$f":"IF(AI6=\"\",\"\",IF(AH6>AI6,\"w\",IF(AH6=AI6,\"g\",\"v\")))","v":""},{"$f":"IF(ISBLANK(VLOOKUP(TEXT($B6,)&\" - \"&TEXT($AK$5,),SchemaKK,2,0)),\"\",VLOOKUP(TEXT($B6,)&\" - \"&TEXT($AK$5,),SchemaKK,2,0))","v":""},{"$f":"IF(ISBLANK(VLOOKUP(TEXT($B6,)&\" - \"&TEXT($AK$5,),SchemaKK,3,0)),\"\",VLOOKUP(TEXT($B6,)&\" - \"&TEXT($AK$5,),SchemaKK,3,0))","v":""},{"$f":"IF(AL6=\"\",\"\",IF(AK6>AL6,\"w\",IF(AK6=AL6,\"g\",\"v\")))","v":""},{"$f":"IF(ISBLANK(VLOOKUP(TEXT($B6,)&\" - \"&TEXT($AN$5,),SchemaKK,2,0)),\"\",VLOOKUP(TEXT($B6,)&\" - \"&TEXT($AN$5,),SchemaKK,2,0))","v":""},{"$f":"IF(ISBLANK(VLOOKUP(TEXT($B6,)&\" - \"&TEXT($AN$5,),SchemaKK,3,0)),\"\",VLOOKUP(TEXT($B6,)&\" - \"&TEXT($AN$5,),SchemaKK,3,0))","v":""},{"$f":"IF(AO6=\"\",\"\",IF(AN6>AO6,\"w\",IF(AN6=AO6,\"g\",\"v\")))","v":""},{"$f":"IF(ISBLANK(VLOOKUP(TEXT($B6,)&\" - \"&TEXT($AQ$5,),SchemaKK,2,0)),\"\",VLOOKUP(TEXT($B6,)&\" - \"&TEXT($AQ$5,),SchemaKK,2,0))","v":""},{"$f":"IF(ISBLANK(VLOOKUP(TEXT($B6,)&\" - \"&TEXT($AQ$5,),SchemaKK,3,0)),\"\",VLOOKUP(TEXT($B6,)&\" - \"&TEXT($AQ$5,),SchemaKK,3,0))","v":""},{"$f":"IF(AR6=\"\",\"\",IF(AQ6>AR6,\"w\",IF(AQ6=AR6,\"g\",\"v\")))","v":""},{"$f":"IF(ISBLANK(VLOOKUP(TEXT($B6,)&\" - \"&TEXT($AT$5,),SchemaKK,2,0)),\"\",VLOOKUP(TEXT($B6,)&\" - \"&TEXT($AT$5,),SchemaKK,2,0))","v":""},{"$f":"IF(ISBLANK(VLOOKUP(TEXT($B6,)&\" - \"&TEXT($AT$5,),SchemaKK,3,0)),\"\",VLOOKUP(TEXT($B6,)&\" - \"&TEXT($AT$5,),SchemaKK,3,0))","v":""},{"$f":"IF(AU6=\"\",\"\",IF(AT6>AU6,\"w\",IF(AT6=AU6,\"g\",\"v\")))","v":""},{"$f":"IF(ISBLANK(VLOOKUP(TEXT($B6,)&\" - \"&TEXT($AW$5,),SchemaKK,2,0)),\"\",VLOOKUP(TEXT($B6,)&\" - \"&TEXT($AW$5,),SchemaKK,2,0))","v":""},{"$f":"IF(ISBLANK(VLOOKUP(TEXT($B6,)&\" - \"&TEXT($AW$5,),SchemaKK,3,0)),\"\",VLOOKUP(TEXT($B6,)&\" - \"&TEXT($AW$5,),SchemaKK,3,0))","v":""},{"$f":"IF(AX6=\"\",\"\",IF(AW6>AX6,\"w\",IF(AW6=AX6,\"g\",\"v\")))","v":""},{"$f":"IF(ISBLANK(VLOOKUP(TEXT($B6,)&\" - \"&TEXT($AZ$5,),SchemaKK,2,0)),\"\",VLOOKUP(TEXT($B6,)&\" - \"&TEXT($AZ$5,),SchemaKK,2,0))","v":""},{"$f":"IF(ISBLANK(VLOOKUP(TEXT($B6,)&\" - \"&TEXT($AZ$5,),SchemaKK,3,0)),\"\",VLOOKUP(TEXT($B6,)&\" - \"&TEXT($AZ$5,),SchemaKK,3,0))","v":""},{"$f":"IF(BA6=\"\",\"\",IF(AZ6>BA6,\"w\",IF(AZ6=BA6,\"g\",\"v\")))","v":""},{"$f":"IF(ISBLANK(VLOOKUP(TEXT($B6,)&\" - \"&TEXT($BC$5,),SchemaKK,2,0)),\"\",VLOOKUP(TEXT($B6,)&\" - \"&TEXT($BC$5,),SchemaKK,2,0))","v":""},{"$f":"IF(ISBLANK(VLOOKUP(TEXT($B6,)&\" - \"&TEXT($BC$5,),SchemaKK,3,0)),\"\",VLOOKUP(TEXT($B6,)&\" - \"&TEXT($BC$5,),SchemaKK,3,0))","v":""},{"$f":"IF(BD6=\"\",\"\",IF(BC6>BD6,\"w\",IF(BC6=BD6,\"g\",\"v\")))","v":""},{"$f":"IF(ISBLANK(VLOOKUP(TEXT($B6,)&\" - \"&TEXT($BF$5,),SchemaKK,2,0)),\"\",VLOOKUP(TEXT($B6,)&\" - \"&TEXT($BF$5,),SchemaKK,2,0))","v":""},{"$f":"IF(ISBLANK(VLOOKUP(TEXT($B6,)&\" - \"&TEXT($BF$5,),SchemaKK,3,0)),\"\",VLOOKUP(TEXT($B6,)&\" - \"&TEXT($BF$5,),SchemaKK,3,0))","v":""},{"$f":"IF(BG6=\"\",\"\",IF(BF6>BG6,\"w\",IF(BF6=BG6,\"g\",\"v\")))","v":""},{"$f":"IF(ISBLANK(VLOOKUP(TEXT($B6,)&\" - \"&TEXT($BI$5,),SchemaKK,2,0)),\"\",VLOOKUP(TEXT($B6,)&\" - \"&TEXT($BI$5,),SchemaKK,2,0))","v":5},{"$f":"IF(ISBLANK(VLOOKUP(TEXT($B6,)&\" - \"&TEXT($BI$5,),SchemaKK,3,0)),\"\",VLOOKUP(TEXT($B6,)&\" - \"&TEXT($BI$5,),SchemaKK,3,0))","v":0},{"$f":"IF(BJ6=\"\",\"\",IF(BI6>BJ6,\"w\",IF(BI6=BJ6,\"g\",\"v\")))","v":"w"},{"$f":"COUNTIF(F6:BK6,\"w\")","v":1},{"$f":"COUNTIF(F6:BK6,\"g\")","v":0},{"$f":"COUNTIF(F6:BK6,\"v\")","v":0},{"$f":"SUM(D6,G6,J6,M6,P6,S6,V6,Y6,AB6,AE6,AH6,AK6,AN6,AQ6,AT6,AW6,AZ6,BC6,BF6,BI6)","v":5},{"$f":"SUM(E6,H6,K6,N6,Q6,T6,W6,Z6,AC6,AF6,AI6,AL6,AO6,AR6,AU6,AX6,BA6,BD6,BG6,BJ6)","v":0},null,{"$f":"RANK(CC6,$CC$6:$CC$25)","v":1},"Go Ahead Eagles",{"$f":"SUM(BU6:BW6)","v":2},{"$f":"INDEX($BL$6:$BL$25,MATCH(BS6,$B$6:$B$25,0))+INDEX($D$27:$BJ$27,MATCH(BS6,$D$5:$BJ$5,0))","v":2},{"$f":"INDEX($BM$6:$BM$25,MATCH(BS6,$B$6:$B$25,0))+INDEX($D$28:$BJ$28,MATCH(BS6,$D$5:$BJ$5,0))","v":0},{"$f":"INDEX($BN$6:$BN$25,MATCH(BS6,$B$6:$B$25,0))+INDEX($D$29:$BJ$29,MATCH(BS6,$D$5:$BJ$5,0))","v":0},null,{"$f":"(BU6*3)+BV6+BX6","v":6},{"$f":"CA6-CB6","v":6},{"$f":"INDEX($BO$6:$BO$25,MATCH(BS6,$B$6:$B$25,0))+INDEX($D$30:$BJ$30,MATCH(BS6,$D$5:$BJ$5,0))","v":7},{"$f":"INDEX($BP$6:$BP$25,MATCH(BS6,$B$6:$B$25,0))+INDEX($D$31:$BJ$31,MATCH(BS6,$D$5:$BJ$5,0))","v":1},{"$f":"VALUE(TEXT(BY6,\"000\")&TEXT(100+BZ6,\"000\")&TEXT(CA6,\"000\")&TEXT(100-BT6,\"00\")&TEXT(COUNTIF($BS$6:$BS$25,\">=\"&BS6),\"00\"))","v":61060079814},null,{"$f":"INDEX($BR$6:$BR$25,MATCH(CF6,$BS$6:$BS$25,0))","v":8},"Jong Ajax"]
[null,{"$f":"BS7","v":"TOP Oss"},null,{"$f":"IF(ISBLANK(VLOOKUP(TEXT($B7,)&\" - \"&TEXT($D$5,),SchemaKK,2,0)),\"\",VLOOKUP(TEXT($B7,)&\" - \"&TEXT($D$5,),SchemaKK,2,0))","v":""},{"$f":"IF(ISBLANK(VLOOKUP(TEXT($B7,)&\" - \"&TEXT($D$5,),SchemaKK,3,0)),\"\",VLOOKUP(TEXT($B7,)&\" - \"&TEXT($D$5,),SchemaKK,3,0))","v":""},{"$f":"IF(E7=\"\",\"\",IF(D7>E7,\"w\",IF(D7=E7,\"g\",\"v\")))","v":""},null,null,null,{"$f":"IF(ISBLANK(VLOOKUP(TEXT($B7,)&\" - \"&TEXT($J$5,),SchemaKK,2,0)),\"\",VLOOKUP(TEXT($B7,)&\" - \"&TEXT($J$5,),SchemaKK,2,0))","v":""},{"$f":"IF(ISBLANK(VLOOKUP(TEXT($B7,)&\" - \"&TEXT($J$5,),SchemaKK,3,0)),\"\",VLOOKUP(TEXT($B7,)&\" - \"&TEXT($J$5,),SchemaKK,3,0))","v":""},"",{"$f":"IF(ISBLANK(VLOOKUP(TEXT($B7,)&\" - \"&TEXT($M$5,),SchemaKK,2,0)),\"\",VLOOKUP(TEXT($B7,)&\" - \"&TEXT($M$5,),SchemaKK,2,0))","v":""},{"$f":"IF(ISBLANK(VLOOKUP(TEXT($B7,)&\" - \"&TEXT($M$5,),SchemaKK,3,0)),\"\",VLOOKUP(TEXT($B7,)&\" - \"&TEXT($M$5,),SchemaKK,3,0))","v":""},"",{"$f":"IF(ISBLANK(VLOOKUP(TEXT($B7,)&\" - \"&TEXT($P$5,),SchemaKK,2,0)),\"\",VLOOKUP(TEXT($B7,)&\" - \"&TEXT($P$5,),SchemaKK,2,0))","v":""},{"$f":"IF(ISBLANK(VLOOKUP(TEXT($B7,)&\" - \"&TEXT($P$5,),SchemaKK,3,0)),\"\",VLOOKUP(TEXT($B7,)&\" - \"&TEXT($P$5,),SchemaKK,3,0))","v":""},"",{"$f":"IF(ISBLANK(VLOOKUP(TEXT($B7,)&\" - \"&TEXT($S$5,),SchemaKK,2,0)),\"\",VLOOKUP(TEXT($B7,)&\" - \"&TEXT($S$5,),SchemaKK,2,0))","v":""},{"$f":"IF(ISBLANK(VLOOKUP(TEXT($B7,)&\" - \"&TEXT($S$5,),SchemaKK,3,0)),\"\",VLOOKUP(TEXT($B7,)&\" - \"&TEXT($S$5,),SchemaKK,3,0))","v":""},"","","","","","","","","","","","","","","","","","","",4,1,"w","","","","","","","","","","","","","","","","","","","","","",1,0,0,4,1,null,2,"TOP Oss",2,2,0,0,null,6,5,6,1,61050069801,null,16,"Jong AZ Alkmaar"]
[null,"RKC Waalwijk",null,"","","",{"$f":"IF(ISBLANK(VLOOKUP(TEXT($B8,)&\" - \"&TEXT($G$5,),SchemaKK,2,0)),\"\",VLOOKUP(TEXT($B8,)&\" - \"&TEXT($G$5,),SchemaKK,2,0))","v":""},{"$f":"IF(ISBLANK(VLOOKUP(TEXT($B8,)&\" - \"&TEXT($G$5,),SchemaKK,3,0)),\"\",VLOOKUP(TEXT($B8,)&\" - \"&TEXT($G$5,),SchemaKK,3,0))","v":""},"",null,null,null,{"$f":"IF(ISBLANK(VLOOKUP(TEXT($B8,)&\" - \"&TEXT($M$5,),SchemaKK,2,0)),\"\",VLOOKUP(TEXT($B8,)&\" - \"&TEXT($M$5,),SchemaKK,2,0))","v":""},{"$f":"IF(ISBLANK(VLOOKUP(TEXT($B8,)&\" - \"&TEXT($M$5,),SchemaKK,3,0)),\"\",VLOOKUP(TEXT($B8,)&\" - \"&TEXT($M$5,),SchemaKK,3,0))","v":""},"",{"$f":"IF(ISBLANK(VLOOKUP(TEXT($B8,)&\" - \"&TEXT($P$5,),SchemaKK,2,0)),\"\",VLOOKUP(TEXT($B8,)&\" - \"&TEXT($P$5,),SchemaKK,2,0))","v":""},{"$f":"IF(ISBLANK(VLOOKUP(TEXT($B8,)&\" - \"&TEXT($P$5,),SchemaKK,3,0)),\"\",VLOOKUP(TEXT($B8,)&\" - \"&TEXT($P$5,),SchemaKK,3,0))","v":""},"",{"$f":"IF(ISBLANK(VLOOKUP(TEXT($B8,)&\" - \"&TEXT($S$5,),SchemaKK,2,0)),\"\",VLOOKUP(TEXT($B8,)&\" - \"&TEXT($S$5,),SchemaKK,2,0))","v":""},{"$f":"IF(ISBLANK(VLOOKUP(TEXT($B8,)&\" - \"&TEXT($S$5,),SchemaKK,3,0)),\"\",VLOOKUP(TEXT($B8,)&\" - \"&TEXT($S$5,),SchemaKK,3,0))","v":""},"","","","","","","","","","","","","","","","","","","","","","","","","","","","","","","","","","",1,0,"w","","","","","","",1,0,0,1,0,null,3,"RKC Waalwijk",2,2,0,0,null,6,2,4,2,61020049806,null,20,"Jong FC Utrecht"]
[null,"Roda JC Kerkrade",null,"","","","","","",{"$f":"IF(ISBLANK(VLOOKUP(TEXT($B9,)&\" - \"&TEXT($J$5,),SchemaKK,2,0)),\"\",VLOOKUP(TEXT($B9,)&\" - \"&TEXT($J$5,),SchemaKK,2,0))","v":""},{"$f":"IF(ISBLANK(VLOOKUP(TEXT($B9,)&\" - \"&TEXT($J$5,),SchemaKK,3,0)),\"\",VLOOKUP(TEXT($B9,)&\" - \"&TEXT($J$5,),SchemaKK,3,0))","v":""},"",null,null,null,{"$f":"IF(ISBLANK(VLOOKUP(TEXT($B9,)&\" - \"&TEXT($P$5,),SchemaKK,2,0)),\"\",VLOOKUP(TEXT($B9,)&\" - \"&TEXT($P$5,),SchemaKK,2,0))","v":""},{"$f":"IF(ISBLANK(VLOOKUP(TEXT($B9,)&\" - \"&TEXT($P$5,),SchemaKK,3,0)),\"\",VLOOKUP(TEXT($B9,)&\" - \"&TEXT($P$5,),SchemaKK,3,0))","v":""},"",{"$f":"IF(ISBLANK(VLOOKUP(TEXT($B9,)&\" - \"&TEXT($S$5,),SchemaKK,2,0)),\"\",VLOOKUP(TEXT($B9,)&\" - \"&TEXT($S$5,),SchemaKK,2,0))","v":""},{"$f":"IF(ISBLANK(VLOOKUP(TEXT($B9,)&\" - \"&TEXT($S$5,),SchemaKK,3,0)),\"\",VLOOKUP(TEXT($B9,)&\" - \"&TEXT($S$5,),SchemaKK,3,0))","v":""},"","","","",2,1,"w","","","","","","","","","","","","","","","","","","","","","","","","","","","","","","","","","","","","",1,0,0,2,1,null,4,"Roda JC Kerkrade",2,2,0,0,null,6,2,4,2,61020049805,null,13,"Jong PSV"]
[null,{"$f":"BS10","v":"FC Twente"},null,"","","","","","","","","",{"$f":"IF(ISBLANK(VLOOKUP(TEXT($B10,)&\" - \"&TEXT($M$5,),SchemaKK,2,0)),\"\",VLOOKUP(TEXT($B10,)&\" - \"&TEXT($M$5,),SchemaKK,2,0))","v":""},{"$f":"IF(ISBLANK(VLOOKUP(TEXT($B10,)&\" - \"&TEXT($M$5,),SchemaKK,3,0)),\"\",VLOOKUP(TEXT($B10,)&\" - \"&TEXT($M$5,),SchemaKK,3,0))","v":""},"",null,null,null,{"$f":"IF(ISBLANK(VLOOKUP(TEXT($B10,)&\" - \"&TEXT($S$5,),SchemaKK,2,0)),\"\",VLOOKUP(TEXT($B10,)&\" - \"&TEXT($S$5,),SchemaKK,2,0))","v":""},{"$f":"IF(ISBLANK(VLOOKUP(TEXT($B10,)&\" - \"&TEXT($S$5,),SchemaKK,3,0)),\"\",VLOOKUP(TEXT($B10,)&\" - \"&TEXT($S$5,),SchemaKK,3,0))","v":""},"","","","","","","",2,1,"w","","","","","","","","","","","","","","","","","","","","","","","","","","","","","","","","","",1,0,0,2,1,null,5,"FC Twente",2,1,1,0,null,4,1,4,3,41010049816]
[null,"NEC Nijmegen",null,"","","","","","","","","","","","",{"$f":"IF(ISBLANK(VLOOKUP(TEXT($B11,)&\" - \"&TEXT($P$5,),SchemaKK,2,0)),\"\",VLOOKUP(TEXT($B11,)&\" - \"&TEXT($P$5,),SchemaKK,2,0))","v":""},{"$f":"IF(ISBLANK(VLOOKUP(TEXT($B11,)&\" - \"&TEXT($P$5,),SchemaKK,3,0)),\"\",VLOOKUP(TEXT($B11,)&\" - \"&TEXT($P$5,),SchemaKK,3,0))","v":""},"",null,null,null,2,2,"g","","","","","","","","","","","","","","","","","","","","","","","","","","","","","","","","","","","","","","","",0,1,0,2,2,null,6,"NEC Nijmegen",2,1,1,0,null,4,1,4,3,41010049807,null,{"$f":"IFERROR(INDEX($BR$6:$BR$25,MATCH(CF11,$BS$6:$BS$25,0)),\"\")","v":10},{"$f":"IF(ISNA(VLOOKUP($BS$36,$CF$6:$CF$10,1,0)),$BS$36,IF(ISNA(VLOOKUP($BS$37,$CF$6:$CF$10,1,0)),$BS$37,\"\"))","v":"Almere City FC"}]
[null,"SC Cambuur",null,"","","","","","","","","","","","","","","",{"$f":"IF(ISBLANK(VLOOKUP(TEXT($B12,)&\" - \"&TEXT($S$5,),SchemaKK,2,0)),\"\",VLOOKUP(TEXT($B12,)&\" - \"&TEXT($S$5,),SchemaKK,2,0))","v":""},{"$f":"IF(ISBLANK(VLOOKUP(TEXT($B12,)&\" - \"&TEXT($S$5,),SchemaKK,3,0)),\"\",VLOOKUP(TEXT($B12,)&\" - \"&TEXT($S$5,),SchemaKK,3,0))","v":""},"",null,null,null,"","","","","","","","","","","","","","","","","","","","","","","","",2,1,"w","","","","","","","","","","","","",1,0,0,2,1,null,7,"SC Cambuur",2,1,1,0,null,4,1,4,3,41010049804,null,{"$f":"IFERROR(INDEX($BR$6:$BR$25,MATCH(CF12,$BS$6:$BS$25,0)),\"\")","v":11},{"$f":"IF(ISNA(VLOOKUP($BS$66,$CF$6:$CF$11,1,0)),$BS$66,IF(ISNA(VLOOKUP($BS$67,$CF$6:$CF$11,1,0)),$BS$67,\"\"))","v":"FC Den Bosch"}]
[null,"Jong Ajax",null,"","","","","","","","","","","","","","","","","","",{"$f":"IF(ISBLANK(VLOOKUP(TEXT($B13,)&\" - \"&TEXT($V$5,),SchemaKK,2,0)),\"\",VLOOKUP(TEXT($B13,)&\" - \"&TEXT($V$5,),SchemaKK,2,0))","v":""},{"$f":"IF(ISBLANK(VLOOKUP(TEXT($B13,)&\" - \"&TEXT($V$5,),SchemaKK,3,0)),\"\",VLOOKUP(TEXT($B13,)&\" - \"&TEXT($V$5,),SchemaKK,3,0))","v":""},"",null,null,null,"","","","","","","","","","","","","","","","","","",5,2,"w","","","","","","","","","","","","","","","",1,0,0,5,2,null,8,"Jong Ajax",2,1,0,1,null,3,2,6,4,31020069812,null,{"$f":"IFERROR(INDEX($BR$6:$BR$25,MATCH(CF13,$BS$6:$BS$25,0)),\"\")","v":15},{"$f":"IF(ISNA(VLOOKUP($BS$96,$CF$6:$CF$12,1,0)),$BS$96,IF(ISNA(VLOOKUP($BS$97,$CF$6:$CF$12,1,0)),$BS$97,IF(ISNA(VLOOKUP($BS$98,$CF$6:$CF$12,1,0)),$BS$98,\"\")))","v":"FC Dordrecht"}]
[null,"Sparta Rotterdam",null,"","","","","","","","","","","","","","","","","","","","","",{"$f":"IF(ISBLANK(VLOOKUP(TEXT($B14,)&\" - \"&TEXT($Y$5,),SchemaKK,2,0)),\"\",VLOOKUP(TEXT($B14,)&\" - \"&TEXT($Y$5,),SchemaKK,2,0))","v":""},{"$f":"IF(ISBLANK(VLOOKUP(TEXT($B14,)&\" - \"&TEXT($Y$5,),SchemaKK,3,0)),\"\",VLOOKUP(TEXT($B14,)&\" - \"&TEXT($Y$5,),SchemaKK,3,0))","v":""},"",null,null,null,"","","","","","","","","","","","","","","","","","","","","","","","","","","",2,0,"w","","","",1,0,0,2,0,null,9,"Sparta Rotterdam",2,1,0,1,null,3,1,3,2,31010039802,null,{"$f":"IFERROR(INDEX($BR$6:$BR$25,MATCH(CF14,$BS$6:$BS$25,0)),\"\")","v":17},{"$f":"IF(ISNA(VLOOKUP($BS$126,$CF$6:$CF$13,1,0)),$BS$126,IF(ISNA(VLOOKUP($BS$127,$CF$6:$CF$13,1,0)),$BS$127,IF(ISNA(VLOOKUP($BS$128,$CF$6:$CF$13,1,0)),$BS$128,IF(ISNA(VLOOKUP($BS$129,$CF$6:$CF$13,1,0)),$BS$129,\"\"))))","v":"FC Eindhoven"}]
[null,"Almere City FC",null,"","","","","","","","","",1,2,"v","","","","","","","","","","","","",{"$f":"IF(ISBLANK(VLOOKUP(TEXT($B15,)&\" - \"&TEXT($AB$5,),SchemaKK,2,0)),\"\",VLOOKUP(TEXT($B15,)&\" - \"&TEXT($AB$5,),SchemaKK,2,0))","v":""},{"$f":"IF(ISBLANK(VLOOKUP(TEXT($B15,)&\" - \"&TEXT($AB$5,),SchemaKK,3,0)),\"\",VLOOKUP(TEXT($B15,)&\" - \"&TEXT($AB$5,),SchemaKK,3,0))","v":""},"",null,null,null,"","","","","","","","","","","","","","","","","","","","","","","","","","","","","","",0,0,1,1,2,null,10,"Almere City FC",2,1,0,1,null,3,0,4,4,31000049820]
[null,"FC Den Bosch",null,"","","","","","",2,3,"v","","","","","","","","","","","","","","","","","","",{"$f":"IF(ISBLANK(VLOOKUP(TEXT($B16,)&\" - \"&TEXT($AE$5,),SchemaKK,2,0)),\"\",VLOOKUP(TEXT($B16,)&\" - \"&TEXT($AE$5,),SchemaKK,2,0))","v":""},{"$f":"IF(ISBLANK(VLOOKUP(TEXT($B16,)&\" - \"&TEXT($AE$5,),SchemaKK,3,0)),\"\",VLOOKUP(TEXT($B16,)&\" - \"&TEXT($AE$5,),SchemaKK,3,0))","v":""},"",null,null,null,"","","","","","","","","","","","","","","","","","","","","","","","","","","",0,0,1,2,3,null,11,"FC Den Bosch",2,1,0,1,null,3,0,4,4,31000049819,null,{"$f":"INDEX($BR$6:$BR$25,MATCH(CF16,$BS$6:$BS$25,0))","v":1},{"$f":"IF(ISNA(VLOOKUP($BS$6,$CF$6:$CF$14,1,0)),$BS$6,IF(ISNA(VLOOKUP($BS$7,$CF$6:$CF$14,1,0)),$BS$7,IF(ISNA(VLOOKUP($BS$8,$CF$6:$CF$14,1,0)),$BS$8,IF(ISNA(VLOOKUP($BS$9,$CF$6:$CF$14,1,0)),$BS$9,IF(ISNA(VLOOKUP($BS$10,$CF$6:$CF$14,1,0)),$BS$10,IF(ISNA(VLOOKUP($BS$11,$CF$6:$CF$14,1,0)),$BS$11,IF(ISNA(VLOOKUP($BS$12,$CF$6:$CF$14,1,0)),$BS$12,IF(ISNA(VLOOKUP($BS$13,$CF$6:$CF$14,1,0)),$BS$13,IF(ISNA(VLOOKUP($BS$14,$CF$6:$CF$14,1,0)),$BS$14,IF(ISNA(VLOOKUP($BS$15,$CF$6:$CF$14,1,0)),$BS$15))))))))))","v":"Go Ahead Eagles"}]
[null,"MVV Maastricht",null,"","","",0,2,"v","","","","","","","","","","","","","","","","","","","","","","","","",{"$f":"IF(ISBLANK(VLOOKUP(TEXT($B17,)&\" - \"&TEXT($AH$5,),SchemaKK,2,0)),\"\",VLOOKUP(TEXT($B17,)&\" - \"&TEXT($AH$5,),SchemaKK,2,0))","v":""},{"$f":"IF(ISBLANK(VLOOKUP(TEXT($B17,)&\" - \"&TEXT($AH$5,),SchemaKK,3,0)),\"\",VLOOKUP(TEXT($B17,)&\" - \"&TEXT($AH$5,),SchemaKK,3,0))","v":""},"",null,null,null,"","","","","","","","","","","","","","","","","","","","","","","","",0,0,1,0,2,null,12,"MVV Maastricht",2,1,0,1,null,3,-1,1,2,30990019808,null,2,{"$f":"IF(ISNA(VLOOKUP($BS$6,$CF$6:$CF$16,1,0)),$BS$6,IF(ISNA(VLOOKUP($BS$7,$CF$6:$CF$16,1,0)),$BS$7,IF(ISNA(VLOOKUP($BS$8,$CF$6:$CF$16,1,0)),$BS$8,IF(ISNA(VLOOKUP($BS$9,$CF$6:$CF$16,1,0)),$BS$9,IF(ISNA(VLOOKUP($BS$10,$CF$6:$CF$16,1,0)),$BS$10,IF(ISNA(VLOOKUP($BS$11,$CF$6:$CF$16,1,0)),$BS$11,IF(ISNA(VLOOKUP($BS$12,$CF$6:$CF$16,1,0)),$BS$12,IF(ISNA(VLOOKUP($BS$13,$CF$6:$CF$16,1,0)),$BS$13,IF(ISNA(VLOOKUP($BS$14,$CF$6:$CF$16,1,0)),$BS$14,IF(ISNA(VLOOKUP($BS$15,$CF$6:$CF$16,1,0)),$BS$15,IF(ISNA(VLOOKUP($BS$16,$CF$6:$CF$16,1,0)),$BS$16)))))))))))","v":"TOP Oss"}]
[null,"Jong PSV",null,"","","","","","","","","","","","","","","","","","","","","","","","","","","","","","","","","",{"$f":"IF(ISBLANK(VLOOKUP(TEXT($B18,)&\" - \"&TEXT($AK$5,),SchemaKK,2,0)),\"\",VLOOKUP(TEXT($B18,)&\" - \"&TEXT($AK$5,),SchemaKK,2,0))","v":""},{"$f":"IF(ISBLANK(VLOOKUP(TEXT($B18,)&\" - \"&TEXT($AK$5,),SchemaKK,3,0)),\"\",VLOOKUP(TEXT($B18,)&\" - \"&TEXT($AK$5,),SchemaKK,3,0))","v":""},"",null,null,null,"","","","","","","","","",2,1,"w","","","","","","","","","",1,0,0,2,1,null,13,"Jong PSV",2,1,0,1,null,3,-2,3,5,30980039809,null,3,{"$f":"IF(ISNA(VLOOKUP($BS$6,$CF$6:$CF$17,1,0)),$BS$6,IF(ISNA(VLOOKUP($BS$7,$CF$6:$CF$17,1,0)),$BS$7,IF(ISNA(VLOOKUP($BS$8,$CF$6:$CF$17,1,0)),$BS$8,IF(ISNA(VLOOKUP($BS$9,$CF$6:$CF$17,1,0)),$BS$9,IF(ISNA(VLOOKUP($BS$10,$CF$6:$CF$17,1,0)),$BS$10,IF(ISNA(VLOOKUP($BS$11,$CF$6:$CF$17,1,0)),$BS$11,IF(ISNA(VLOOKUP($BS$12,$CF$6:$CF$17,1,0)),$BS$12,IF(ISNA(VLOOKUP($BS$13,$CF$6:$CF$17,1,0)),$BS$13,IF(ISNA(VLOOKUP($BS$14,$CF$6:$CF$17,1,0)),$BS$14,IF(ISNA(VLOOKUP($BS$15,$CF$6:$CF$17,1,0)),$BS$15,IF(ISNA(VLOOKUP($BS$16,$CF$6:$CF$17,1,0)),$BS$16,IF(ISNA(VLOOKUP($BS$17,$CF$6:$CF$17,1,0)),$BS$17))))))))))))","v":"RKC Waalwijk"}]
[null,"Helmond Sport",null,"","","","","","","","","","","","",2,2,"g","","","","","","","","","","","","","","","","","","","","","",{"$f":"IF(ISBLANK(VLOOKUP(TEXT($B19,)&\" - \"&TEXT($AN$5,),SchemaKK,2,0)),\"\",VLOOKUP(TEXT($B19,)&\" - \"&TEXT($AN$5,),SchemaKK,2,0))","v":""},{"$f":"IF(ISBLANK(VLOOKUP(TEXT($B19,)&\" - \"&TEXT($AN$5,),SchemaKK,3,0)),\"\",VLOOKUP(TEXT($B19,)&\" - \"&TEXT($AN$5,),SchemaKK,3,0))","v":""},"",null,null,null,"","","","","","","","","","","","","","","","","","",0,1,0,2,2,null,14,"Helmond Sport",2,0,2,0,null,2,0,2,2,21000029813,null,4,{"$f":"IF(ISNA(VLOOKUP($BS$6,$CF$6:$CF$18,1,0)),$BS$6,IF(ISNA(VLOOKUP($BS$7,$CF$6:$CF$18,1,0)),$BS$7,IF(ISNA(VLOOKUP($BS$8,$CF$6:$CF$18,1,0)),$BS$8,IF(ISNA(VLOOKUP($BS$9,$CF$6:$CF$18,1,0)),$BS$9,IF(ISNA(VLOOKUP($BS$10,$CF$6:$CF$18,1,0)),$BS$10,IF(ISNA(VLOOKUP($BS$11,$CF$6:$CF$18,1,0)),$BS$11,IF(ISNA(VLOOKUP($BS$12,$CF$6:$CF$18,1,0)),$BS$12,IF(ISNA(VLOOKUP($BS$13,$CF$6:$CF$18,1,0)),$BS$13,IF(ISNA(VLOOKUP($BS$14,$CF$6:$CF$18,1,0)),$BS$14,IF(ISNA(VLOOKUP($BS$15,$CF$6:$CF$18,1,0)),$BS$15,IF(ISNA(VLOOKUP($BS$16,$CF$6:$CF$18,1,0)),$BS$16,IF(ISNA(VLOOKUP($BS$17,$CF$6:$CF$18,1,0)),$BS$17,IF(ISNA(VLOOKUP($BS$18,$CF$6:$CF$18,1,0)),$BS$18)))))))))))))","v":"Roda JC Kerkrade"}]
[null,"FC Dordrecht",null,"","","","","","","","","","","","","","","","","","","","","","","","","","","","","","","","","","","","","","","",{"$f":"IF(ISBLANK(VLOOKUP(TEXT($B20,)&\" - \"&TEXT($AQ$5,),SchemaKK,2,0)),\"\",VLOOKUP(TEXT($B20,)&\" - \"&TEXT($AQ$5,),SchemaKK,2,0))","v":0},{"$f":"IF(ISBLANK(VLOOKUP(TEXT($B20,)&\" - \"&TEXT($AQ$5,),SchemaKK,3,0)),\"\",VLOOKUP(TEXT($B20,)&\" - \"&TEXT($AQ$5,),SchemaKK,3,0))","v":0},"g",null,null,null,"","","","","","","","","","","","","","","",0,1,0,0,0,null,15,"FC Dordrecht",2,0,1,1,null,1,-3,2,5,10970029818,null,5,{"$f":"IF(ISNA(VLOOKUP($BS$6,$CF$6:$CF$19,1,0)),$BS$6,IF(ISNA(VLOOKUP($BS$7,$CF$6:$CF$19,1,0)),$BS$7,IF(ISNA(VLOOKUP($BS$8,$CF$6:$CF$19,1,0)),$BS$8,IF(ISNA(VLOOKUP($BS$9,$CF$6:$CF$19,1,0)),$BS$9,IF(ISNA(VLOOKUP($BS$10,$CF$6:$CF$19,1,0)),$BS$10,IF(ISNA(VLOOKUP($BS$11,$CF$6:$CF$19,1,0)),$BS$11,IF(ISNA(VLOOKUP($BS$12,$CF$6:$CF$19,1,0)),$BS$12,IF(ISNA(VLOOKUP($BS$13,$CF$6:$CF$19,1,0)),$BS$13,IF(ISNA(VLOOKUP($BS$14,$CF$6:$CF$19,1,0)),$BS$14,IF(ISNA(VLOOKUP($BS$15,$CF$6:$CF$19,1,0)),$BS$15,IF(ISNA(VLOOKUP($BS$16,$CF$6:$CF$19,1,0)),$BS$16,IF(ISNA(VLOOKUP($BS$17,$CF$6:$CF$19,1,0)),$BS$17,IF(ISNA(VLOOKUP($BS$18,$CF$6:$CF$19,1,0)),$BS$18,IF(ISNA(VLOOKUP($BS$19,$CF$6:$CF$19,1,0)),$BS$19))))))))))))))","v":"FC Twente"}]
[null,"Jong AZ Alkmaar",null,"","","","","","","","","","","","","","","","","","","","","","","","","","","",2,3,"v","","","","","","","","","","","","",{"$f":"IF(ISBLANK(VLOOKUP(TEXT($B21,)&\" - \"&TEXT($AT$5,),SchemaKK,2,0)),\"\",VLOOKUP(TEXT($B21,)&\" - \"&TEXT($AT$5,),SchemaKK,2,0))","v":""},{"$f":"IF(ISBLANK(VLOOKUP(TEXT($B21,)&\" - \"&TEXT($AT$5,),SchemaKK,3,0)),\"\",VLOOKUP(TEXT($B21,)&\" - \"&TEXT($AT$5,),SchemaKK,3,0))","v":""},"",null,null,null,"","","","","","","","","","","","",0,0,1,2,3,null,16,"Jong AZ Alkmaar",2,0,0,2,null,0,-2,3,5,980039811]
[null,"FC Eindhoven",null,1,2,"v","","","","","","","","","","","","","","","","","","","","","","","","","","","","","","","","","","","","","","","",{"$f":"IF(ISBLANK(VLOOKUP(TEXT($B22,)&\" - \"&TEXT($AT$5,),SchemaKK,2,0)),\"\",VLOOKUP(TEXT($B22,)&\" - \"&TEXT($AT$5,),SchemaKK,2,0))","v":""},{"$f":"IF(ISBLANK(VLOOKUP(TEXT($B22,)&\" - \"&TEXT($AT$5,),SchemaKK,3,0)),\"\",VLOOKUP(TEXT($B22,)&\" - \"&TEXT($AT$5,),SchemaKK,3,0))","v":""},"",{"$f":"IF(ISBLANK(VLOOKUP(TEXT($B22,)&\" - \"&TEXT($AW$5,),SchemaKK,2,0)),\"\",VLOOKUP(TEXT($B22,)&\" - \"&TEXT($AW$5,),SchemaKK,2,0))","v":""},{"$f":"IF(ISBLANK(VLOOKUP(TEXT($B22,)&\" - \"&TEXT($AW$5,),SchemaKK,3,0)),\"\",VLOOKUP(TEXT($B22,)&\" - \"&TEXT($AW$5,),SchemaKK,3,0))","v":""},"",null,null,null,"","","","","","","","","",0,0,1,1,2,null,17,"FC Eindhoven",2,0,0,2,null,0,-2,2,4,980029817,null,1,{"$f":"IF(ISNA(VLOOKUP($BS$6,$CF$6:$CF$9,1,0)),$BS$6,IF(ISNA(VLOOKUP($BS$7,$CF$6:$CF$9,1,0)),$BS$7,IF(ISNA(VLOOKUP($BS$8,$CF$6:$CF$9,1,0)),$BS$8,IF(ISNA(VLOOKUP($BS$9,$CF$6:$CF$9,1,0)),$BS$9))))","v":"Go Ahead Eagles"}]
[null,"SC Telstar",null,"","","","","","","","","","","","","","","","","","","","","","","","","","","","","","","","","",0,1,"v","","","","","","",{"$f":"IF(ISBLANK(VLOOKUP(TEXT($B23,)&\" - \"&TEXT($AT$5,),SchemaKK,2,0)),\"\",VLOOKUP(TEXT($B23,)&\" - \"&TEXT($AT$5,),SchemaKK,2,0))","v":""},{"$f":"IF(ISBLANK(VLOOKUP(TEXT($B23,)&\" - \"&TEXT($AT$5,),SchemaKK,3,0)),\"\",VLOOKUP(TEXT($B23,)&\" - \"&TEXT($AT$5,),SchemaKK,3,0))","v":""},"",{"$f":"IF(ISBLANK(VLOOKUP(TEXT($B23,)&\" - \"&TEXT($AW$5,),SchemaKK,2,0)),\"\",VLOOKUP(TEXT($B23,)&\" - \"&TEXT($AW$5,),SchemaKK,2,0))","v":""},{"$f":"IF(ISBLANK(VLOOKUP(TEXT($B23,)&\" - \"&TEXT($AW$5,),SchemaKK,3,0)),\"\",VLOOKUP(TEXT($B23,)&\" - \"&TEXT($AW$5,),SchemaKK,3,0))","v":""},"",{"$f":"IF(ISBLANK(VLOOKUP(TEXT($B23,)&\" - \"&TEXT($AZ$5,),SchemaKK,2,0)),\"\",VLOOKUP(TEXT($B23,)&\" - \"&TEXT($AZ$5,),SchemaKK,2,0))","v":""},{"$f":"IF(ISBLANK(VLOOKUP(TEXT($B23,)&\" - \"&TEXT($AZ$5,),SchemaKK,3,0)),\"\",VLOOKUP(TEXT($B23,)&\" - \"&TEXT($AZ$5,),SchemaKK,3,0))","v":""},"",null,null,null,"","","","","","",0,0,1,0,1,null,18,"SC Telstar",2,0,0,2,null,0,-2,0,2,980009803]
[null,"FC Volendam",null,"","","","","","","","","","","","","","","","","","","","","","","","","","","","","","",1,2,"v","","","","","","","","","",{"$f":"IF(ISBLANK(VLOOKUP(TEXT($B24,)&\" - \"&TEXT($AT$5,),SchemaKK,2,0)),\"\",VLOOKUP(TEXT($B24,)&\" - \"&TEXT($AT$5,),SchemaKK,2,0))","v":""},{"$f":"IF(ISBLANK(VLOOKUP(TEXT($B24,)&\" - \"&TEXT($AT$5,),SchemaKK,3,0)),\"\",VLOOKUP(TEXT($B24,)&\" - \"&TEXT($AT$5,),SchemaKK,3,0))","v":""},"",{"$f":"IF(ISBLANK(VLOOKUP(TEXT($B24,)&\" - \"&TEXT($AW$5,),SchemaKK,2,0)),\"\",VLOOKUP(TEXT($B24,)&\" - \"&TEXT($AW$5,),SchemaKK,2,0))","v":""},{"$f":"IF(ISBLANK(VLOOKUP(TEXT($B24,)&\" - \"&TEXT($AW$5,),SchemaKK,3,0)),\"\",VLOOKUP(TEXT($B24,)&\" - \"&TEXT($AW$5,),SchemaKK,3,0))","v":""},"",{"$f":"IF(ISBLANK(VLOOKUP(TEXT($B24,)&\" - \"&TEXT($AZ$5,),SchemaKK,2,0)),\"\",VLOOKUP(TEXT($B24,)&\" - \"&TEXT($AZ$5,),SchemaKK,2,0))","v":""},{"$f":"IF(ISBLANK(VLOOKUP(TEXT($B24,)&\" - \"&TEXT($AZ$5,),SchemaKK,3,0)),\"\",VLOOKUP(TEXT($B24,)&\" - \"&TEXT($AZ$5,),SchemaKK,3,0))","v":""},"",{"$f":"IF(ISBLANK(VLOOKUP(TEXT($B24,)&\" - \"&TEXT($BC$5,),SchemaKK,2,0)),\"\",VLOOKUP(TEXT($B24,)&\" - \"&TEXT($BC$5,),SchemaKK,2,0))","v":""},{"$f":"IF(ISBLANK(VLOOKUP(TEXT($B24,)&\" - \"&TEXT($BC$5,),SchemaKK,3,0)),\"\",VLOOKUP(TEXT($B24,)&\" - \"&TEXT($BC$5,),SchemaKK,3,0))","v":""},"",null,null,null,"","","",0,0,1,1,2,null,19,"FC Volendam",2,0,0,2,null,0,-3,1,4,970019815,null,2,{"$f":"VLOOKUP(SMALL($CE$11:$CE$20,CE24),$CE$11:$CF$20,2,0)","v":"TOP Oss"}]
[null,"Jong FC Utrecht",null,"","","","","","","","","","","","","","","",1,2,"v","","","","","","","","","","","","","","","","","","","","","","","","",{"$f":"IF(ISBLANK(VLOOKUP(TEXT($B25,)&\" - \"&TEXT($AT$5,),SchemaKK,2,0)),\"\",VLOOKUP(TEXT($B25,)&\" - \"&TEXT($AT$5,),SchemaKK,2,0))","v":""},{"$f":"IF(ISBLANK(VLOOKUP(TEXT($B25,)&\" - \"&TEXT($AT$5,),SchemaKK,3,0)),\"\",VLOOKUP(TEXT($B25,)&\" - \"&TEXT($AT$5,),SchemaKK,3,0))","v":""},"",{"$f":"IF(ISBLANK(VLOOKUP(TEXT($B25,)&\" - \"&TEXT($AW$5,),SchemaKK,2,0)),\"\",VLOOKUP(TEXT($B25,)&\" - \"&TEXT($AW$5,),SchemaKK,2,0))","v":""},{"$f":"IF(ISBLANK(VLOOKUP(TEXT($B25,)&\" - \"&TEXT($AW$5,),SchemaKK,3,0)),\"\",VLOOKUP(TEXT($B25,)&\" - \"&TEXT($AW$5,),SchemaKK,3,0))","v":""},"",{"$f":"IF(ISBLANK(VLOOKUP(TEXT($B25,)&\" - \"&TEXT($AZ$5,),SchemaKK,2,0)),\"\",VLOOKUP(TEXT($B25,)&\" - \"&TEXT($AZ$5,),SchemaKK,2,0))","v":""},{"$f":"IF(ISBLANK(VLOOKUP(TEXT($B25,)&\" - \"&TEXT($AZ$5,),SchemaKK,3,0)),\"\",VLOOKUP(TEXT($B25,)&\" - \"&TEXT($AZ$5,),SchemaKK,3,0))","v":""},"",{"$f":"IF(ISBLANK(VLOOKUP(TEXT($B25,)&\" - \"&TEXT($BC$5,),SchemaKK,2,0)),\"\",VLOOKUP(TEXT($B25,)&\" - \"&TEXT($BC$5,),SchemaKK,2,0))","v":""},{"$f":"IF(ISBLANK(VLOOKUP(TEXT($B25,)&\" - \"&TEXT($BC$5,),SchemaKK,3,0)),\"\",VLOOKUP(TEXT($B25,)&\" - \"&TEXT($BC$5,),SchemaKK,3,0))","v":""},"",{"$f":"IF(ISBLANK(VLOOKUP(TEXT($B25,)&\" - \"&TEXT($BF$5,),SchemaKK,2,0)),\"\",VLOOKUP(TEXT($B25,)&\" - \"&TEXT($BF$5,),SchemaKK,2,0))","v":""},{"$f":"IF(ISBLANK(VLOOKUP(TEXT($B25,)&\" - \"&TEXT($BF$5,),SchemaKK,3,0)),\"\",VLOOKUP(TEXT($B25,)&\" - \"&TEXT($BF$5,),SchemaKK,3,0))","v":""},"",null,null,null,0,0,1,1,2,null,20,"Jong FC Utrecht",2,0,0,2,null,0,-6,1,7,940019810,null,3,"RKC Waalwijk"]
[null,null,null,null,null,null,null,null,null,null,null,null,null,null,null,null,null,null,null,null,null,null,null,null,null,null,null,null,null,null,null,null,null,null,null,null,null,null,null,null,null,null,null,null,null,null,null,null,null,null,null,null,null,null,null,null,null,null,null,null,null,null,null,null,null,null,null,null,null,null,null,null,null,null,null,null,null,null,null,null,null,null,4,"Roda JC Kerkrade"]
[null,"Winst uit",null,{"$f":"COUNTIF(F$6:F$25,\"v\")","v":1},null,null,{"$f":"COUNTIF(I$6:I$25,\"v\")","v":1},null,null,{"$f":"COUNTIF(L$6:L$25,\"v\")","v":1},null,null,{"$f":"COUNTIF(O$6:O$25,\"v\")","v":1},null,null,{"$f":"COUNTIF(R$6:R$25,\"v\")","v":0},null,null,{"$f":"COUNTIF(U$6:U$25,\"v\")","v":1},null,null,{"$f":"COUNTIF(X$6:X$25,\"v\")","v":0},null,null,{"$f":"COUNTIF(AA$6:AA$25,\"v\")","v":0},null,null,{"$f":"COUNTIF(AD$6:AD$25,\"v\")","v":0},null,null,{"$f":"COUNTIF(AG$6:AG$25,\"v\")","v":1},null,null,{"$f":"COUNTIF(AJ$6:AJ$25,\"v\")","v":1},null,null,{"$f":"COUNTIF(AM$6:AM$25,\"v\")","v":1},null,null,{"$f":"COUNTIF(AP$6:AP$25,\"v\")","v":0},null,null,{"$f":"COUNTIF(AS$6:AS$25,\"v\")","v":0},null,null,{"$f":"COUNTIF(AV$6:AV$25,\"v\")","v":0},null,null,{"$f":"COUNTIF(AY$6:AY$25,\"v\")","v":0},null,null,{"$f":"COUNTIF(BB$6:BB$25,\"v\")","v":0},null,null,{"$f":"COUNTIF(BE$6:BE$25,\"v\")","v":0},null,null,{"$f":"COUNTIF(BH$6:BH$25,\"v\")","v":0},null,null,{"$f":"COUNTIF(BK$6:BK$25,\"v\")","v":0},null,null,null,null,null,null,null,null,null," Promotie",null,null,null,null,null,null,null,null,null,null,null,5,"FC Twente"]
[null,"Gelijk uit",null,{"$f":"COUNTIF(F$6:F$25,\"g\")","v":0},null,null,{"$f":"COUNTIF(I$6:I$25,\"g\")","v":0},null,null,{"$f":"COUNTIF(L$6:L$25,\"g\")","v":0},null,null,{"$f":"COUNTIF(O$6:O$25,\"g\")","v":0},null,null,{"$f":"COUNTIF(R$6:R$25,\"g\")","v":1},null,null,{"$f":"COUNTIF(U$6:U$25,\"g\")","v":0},null,null,{"$f":"COUNTIF(X$6:X$25,\"g\")","v":1},null,null,{"$f":"COUNTIF(AA$6:AA$25,\"g\")","v":0},null,null,{"$f":"COUNTIF(AD$6:AD$25,\"g\")","v":0},null,null,{"$f":"COUNTIF(AG$6:AG$25,\"g\")","v":0},null,null,{"$f":"COUNTIF(AJ$6:AJ$25,\"g\")","v":0},null,null,{"$f":"COUNTIF(AM$6:AM$25,\"g\")","v":0},null,null,{"$f":"COUNTIF(AP$6:AP$25,\"g\")","v":0},null,null,{"$f":"COUNTIF(AS$6:AS$25,\"g\")","v":1},null,null,{"$f":"COUNTIF(AV$6:AV$25,\"g\")","v":0},null,null,{"$f":"COUNTIF(AY$6:AY$25,\"g\")","v":0},null,null,{"$f":"COUNTIF(BB$6:BB$25,\"g\")","v":0},null,null,{"$f":"COUNTIF(BE$6:BE$25,\"g\")","v":0},null,null,{"$f":"COUNTIF(BH$6:BH$25,\"g\")","v":0},null,null,{"$f":"COUNTIF(BK$6:BK$25,\"g\")","v":0},null,null,null,null,null,null,null,null,null," Promotie halve finales",null,null,null,null,null,null,null,null,null,null,null,6,"Almere City FC"]
[null,"Verlies uit",null,{"$f":"COUNTIF(F$6:F$25,\"w\")","v":0},null,null,{"$f":"COUNTIF(I$6:I$25,\"w\")","v":0},null,null,{"$f":"COUNTIF(L$6:L$25,\"w\")","v":0},null,null,{"$f":"COUNTIF(O$6:O$25,\"w\")","v":0},null,null,{"$f":"COUNTIF(R$6:R$25,\"w\")","v":0},null,null,{"$f":"COUNTIF(U$6:U$25,\"w\")","v":0},null,null,{"$f":"COUNTIF(X$6:X$25,\"w\")","v":0},null,null,{"$f":"COUNTIF(AA$6:AA$25,\"w\")","v":1},null,null,{"$f":"COUNTIF(AD$6:AD$25,\"w\")","v":1},null,null,{"$f":"COUNTIF(AG$6:AG$25,\"w\")","v":0},null,null,{"$f":"COUNTIF(AJ$6:AJ$25,\"w\")","v":0},null,null,{"$f":"COUNTIF(AM$6:AM$25,\"w\")","v":0},null,null,{"$f":"COUNTIF(AP$6:AP$25,\"w\")","v":1},null,null,{"$f":"COUNTIF(AS$6:AS$25,\"w\")","v":0},null,null,{"$f":"COUNTIF(AV$6:AV$25,\"w\")","v":1},null,null,{"$f":"COUNTIF(AY$6:AY$25,\"w\")","v":1},null,null,{"$f":"COUNTIF(BB$6:BB$25,\"w\")","v":1},null,null,{"$f":"COUNTIF(BE$6:BE$25,\"w\")","v":1},null,null,{"$f":"COUNTIF(BH$6:BH$25,\"w\")","v":1},null,null,{"$f":"COUNTIF(BK$6:BK$25,\"w\")","v":1},null,null,null,null,null,null,null,null,null," Promotie kwart finales",null,null,null,null,null,null,null,null,null,null,null,7,"FC Den Bosch"]
[null,"Vóór uit",null,{"$f":"SUM(E6:E25)","v":2},null,null,{"$f":"SUM(H6:H25)","v":2},null,null,{"$f":"SUM(K6:K25)","v":3},null,null,{"$f":"SUM(N6:N25)","v":2},null,null,{"$f":"SUM(Q6:Q25)","v":2},null,null,{"$f":"SUM(T6:T25)","v":2},null,null,{"$f":"SUM(W6:W25)","v":2},null,null,{"$f":"SUM(Z6:Z25)","v":1},null,null,{"$f":"SUM(AC6:AC25)","v":1},null,null,{"$f":"SUM(AF6:AF25)","v":3},null,null,{"$f":"SUM(AI6:AI25)","v":2},null,null,{"$f":"SUM(AL6:AL25)","v":1},null,null,{"$f":"SUM(AO6:AO25)","v":1},null,null,{"$f":"SUM(AR6:AR25)","v":0},null,null,{"$f":"SUM(AU6:AU25)","v":2},null,null,{"$f":"SUM(AX6:AX25)","v":1},null,null,{"$f":"SUM(BA6:BA25)","v":1},null,null,{"$f":"SUM(BD6:BD25)","v":0},null,null,{"$f":"SUM(BG6:BG25)","v":0},null,null,{"$f":"SUM(BJ6:BJ25)","v":0},null,null,null,null,null,null,null,null,null," Degradatie",null,null,null,null,null,null,null,null,null,null,null,8,"FC Dordrecht"]
[null,"Tegen uit",null,{"$f":"SUM(D6:D25)","v":1},null,null,{"$f":"SUM(G6:G25)","v":0},null,null,{"$f":"SUM(J6:J25)","v":2},null,null,{"$f":"SUM(M6:M25)","v":1},null,null,{"$f":"SUM(P6:P25)","v":2},null,null,{"$f":"SUM(S6:S25)","v":1},null,null,{"$f":"SUM(V6:V25)","v":2},null,null,{"$f":"SUM(Y6:Y25)","v":2},null,null,{"$f":"SUM(AB6:AB25)","v":2},null,null,{"$f":"SUM(AE6:AE25)","v":2},null,null,{"$f":"SUM(AH6:AH25)","v":1},null,null,{"$f":"SUM(AK6:AK25)","v":0},null,null,{"$f":"SUM(AN6:AN25)","v":4},null,null,{"$f":"SUM(AQ6:AQ25)","v":0},null,null,{"$f":"SUM(AT6:AT25)","v":5},null,null,{"$f":"SUM(AW6:AW25)","v":2},null,null,{"$f":"SUM(AZ6:AZ25)","v":2},null,null,{"$f":"SUM(BC6:BC25)","v":1},null,null,{"$f":"SUM(BF6:BF25)","v":2},null,null,{"$f":"SUM(BI6:BI25)","v":5},null,null,null,null,null,null,null,null,null," Uitgesloten",null,null,null,null,null,null,null,null,null,null,null,9,"FC Eindhoven"]
[]
[]
[]
[null,"Periode 1",null,{"$f":"$B$36","v":"Almere City FC"},null,null,{"$f":"$B$37","v":"FC Den Bosch"},null,null,{"$f":"$B$38","v":"FC Dordrecht"},null,null,{"$f":"$B$39","v":"FC Eindhoven"},null,null,{"$f":"$B$40","v":"FC Twente"},null,null,{"$f":"$B$41","v":"FC Volendam"},null,null,{"$f":"$B$42","v":"Go Ahead Eagles"},null,null,{"$f":"$B$43","v":"Helmond Sport"},null,null,{"$f":"$B$44","v":"Jong Ajax"},null,null,{"$f":"$B$45","v":"Jong AZ Alkmaar"},null,null,{"$f":"$B$46","v":"Jong FC Utrecht"},null,null,{"$f":"$B$47","v":"Jong PSV"},null,null,{"$f":"$B$48","v":"MVV Maastricht"},null,null,{"$f":"$B$49","v":"NEC Nijmegen"},null,null,{"$f":"$B$50","v":"RKC Waalwijk"},null,null,{"$f":"$B$51","v":"Roda JC Kerkrade"},null,null,{"$f":"$B$52","v":"SC Cambuur"},null,null,{"$f":"$B$53","v":"SC Telstar"},null,null,{"$f":"$B$54","v":"Sparta Rotterdam"},null,null,{"$f":"$B$55","v":"TOP Oss"},null,null,"Winst thuis","Gelijk thuis","Verlies thuis","Vóór thuis","Tegen thuis",null,"Plaats","Team","Gespeeld","Winst","Gelijk","Verlies","Straf","Punten","Doelsaldo","Vóór","Tegen","Code"]
[null,{"$f":"BS36","v":"Almere City FC"},null,null,null,null,{"$f":"IFERROR(IF(ISBLANK(VLOOKUP(TEXT($B36,)&\" - \"&TEXT($G$35,),SchemaKK1,2,0)),\"\",VLOOKUP(TEXT($B36,)&\" - \"&TEXT($G$35,),SchemaKK1,2,0)),\"\")","v":""},{"$f":"IFERROR(IF(ISBLANK(VLOOKUP(TEXT($B36,)&\" - \"&TEXT($G$35,),SchemaKK1,3,0)),\"\",VLOOKUP(TEXT($B36,)&\" - \"&TEXT($G$35,),SchemaKK1,3,0)),\"\")","v":""},{"$f":"IF(H36=\"\",\"\",IF(G36>H36,\"w\",IF(G36=H36,\"g\",\"v\")))","v":""},{"$f":"IFERROR(IF(ISBLANK(VLOOKUP(TEXT($B36,)&\" - \"&TEXT($J$35,),SchemaKK1,2,0)),\"\",VLOOKUP(TEXT($B36,)&\" - \"&TEXT($J$35,),SchemaKK1,2,0)),\"\")","v":""},{"$f":"IFERROR(IF(ISBLANK(VLOOKUP(TEXT($B36,)&\" - \"&TEXT($J$35,),SchemaKK1,3,0)),\"\",VLOOKUP(TEXT($B36,)&\" - \"&TEXT($J$35,),SchemaKK1,3,0)),\"\")","v":""},{"$f":"IF(K36=\"\",\"\",IF(J36>K36,\"w\",IF(J36=K36,\"g\",\"v\")))","v":""},{"$f":"IFERROR(IF(ISBLANK(VLOOKUP(TEXT($B36,)&\" - \"&TEXT($M$35,),SchemaKK1,2,0)),\"\",VLOOKUP(TEXT($B36,)&\" - \"&TEXT($M$35,),SchemaKK1,2,0)),\"\")","v":""},{"$f":"IFERROR(IF(ISBLANK(VLOOKUP(TEXT($B36,)&\" - \"&TEXT($M$35,),SchemaKK1,3,0)),\"\",VLOOKUP(TEXT($B36,)&\" - \"&TEXT($M$35,),SchemaKK1,3,0)),\"\")","v":""},{"$f":"IF(N36=\"\",\"\",IF(M36>N36,\"w\",IF(M36=N36,\"g\",\"v\")))","v":""},{"$f":"IFERROR(IF(ISBLANK(VLOOKUP(TEXT($B36,)&\" - \"&TEXT($P$35,),SchemaKK1,2,0)),\"\",VLOOKUP(TEXT($B36,)&\" - \"&TEXT($P$35,),SchemaKK1,2,0)),\"\")","v":""},{"$f":"IFERROR(IF(ISBLANK(VLOOKUP(TEXT($B36,)&\" - \"&TEXT($P$35,),SchemaKK1,3,0)),\"\",VLOOKUP(TEXT($B36,)&\" - \"&TEXT($P$35,),SchemaKK1,3,0)),\"\")","v":""},{"$f":"IF(Q36=\"\",\"\",IF(P36>Q36,\"w\",IF(P36=Q36,\"g\",\"v\")))","v":""},{"$f":"IFERROR(IF(ISBLANK(VLOOKUP(TEXT($B36,)&\" - \"&TEXT($S$35,),SchemaKK1,2,0)),\"\",VLOOKUP(TEXT($B36,)&\" - \"&TEXT($S$35,),SchemaKK1,2,0)),\"\")","v":""},{"$f":"IFERROR(IF(ISBLANK(VLOOKUP(TEXT($B36,)&\" - \"&TEXT($S$35,),SchemaKK1,3,0)),\"\",VLOOKUP(TEXT($B36,)&\" - \"&TEXT($S$35,),SchemaKK1,3,0)),\"\")","v":""},{"$f":"IF(T36=\"\",\"\",IF(S36>T36,\"w\",IF(S36=T36,\"g\",\"v\")))","v":""},{"$f":"IFERROR(IF(ISBLANK(VLOOKUP(TEXT($B36,)&\" - \"&TEXT($V$35,),SchemaKK1,2,0)),\"\",VLOOKUP(TEXT($B36,)&\" - \"&TEXT($V$35,),SchemaKK1,2,0)),\"\")","v":""},{"$f":"IFERROR(IF(ISBLANK(VLOOKUP(TEXT($B36,)&\" - \"&TEXT($V$35,),SchemaKK1,3,0)),\"\",VLOOKUP(TEXT($B36,)&\" - \"&TEXT($V$35,),SchemaKK1,3,0)),\"\")","v":""},{"$f":"IF(W36=\"\",\"\",IF(V36>W36,\"w\",IF(V36=W36,\"g\",\"v\")))","v":""},{"$f":"IFERROR(IF(ISBLANK(VLOOKUP(TEXT($B36,)&\" - \"&TEXT($Y$35,),SchemaKK1,2,0)),\"\",VLOOKUP(TEXT($B36,)&\" - \"&TEXT($Y$35,),SchemaKK1,2,0)),\"\")","v":""},{"$f":"IFERROR(IF(ISBLANK(VLOOKUP(TEXT($B36,)&\" - \"&TEXT($Y$35,),SchemaKK1,3,0)),\"\",VLOOKUP(TEXT($B36,)&\" - \"&TEXT($Y$35,),SchemaKK1,3,0)),\"\")","v":""},{"$f":"IF(Z36=\"\",\"\",IF(Y36>Z36,\"w\",IF(Y36=Z36,\"g\",\"v\")))","v":""},{"$f":"IFERROR(IF(ISBLANK(VLOOKUP(TEXT($B36,)&\" - \"&TEXT($AB$35,),SchemaKK1,2,0)),\"\",VLOOKUP(TEXT($B36,)&\" - \"&TEXT($AB$35,),SchemaKK1,2,0)),\"\")","v":""},{"$f":"IFERROR(IF(ISBLANK(VLOOKUP(TEXT($B36,)&\" - \"&TEXT($AB$35,),SchemaKK1,3,0)),\"\",VLOOKUP(TEXT($B36,)&\" - \"&TEXT($AB$35,),SchemaKK1,3,0)),\"\")","v":""},{"$f":"IF(AC36=\"\",\"\",IF(AB36>AC36,\"w\",IF(AB36=AC36,\"g\",\"v\")))","v":""},{"$f":"IFERROR(IF(ISBLANK(VLOOKUP(TEXT($B36,)&\" - \"&TEXT($AE$35,),SchemaKK1,2,0)),\"\",VLOOKUP(TEXT($B36,)&\" - \"&TEXT($AE$35,),SchemaKK1,2,0)),\"\")","v":""},{"$f":"IFERROR(IF(ISBLANK(VLOOKUP(TEXT($B36,)&\" - \"&TEXT($AE$35,),SchemaKK1,3,0)),\"\",VLOOKUP(TEXT($B36,)&\" - \"&TEXT($AE$35,),SchemaKK1,3,0)),\"\")","v":""},{"$f":"IF(AF36=\"\",\"\",IF(AE36>AF36,\"w\",IF(AE36=AF36,\"g\",\"v\")))","v":""},{"$f":"IFERROR(IF(ISBLANK(VLOOKUP(TEXT($B36,)&\" - \"&TEXT($AH$35,),SchemaKK1,2,0)),\"\",VLOOKUP(TEXT($B36,)&\" - \"&TEXT($AH$35,),SchemaKK1,2,0)),\"\")","v":""},{"$f":"IFERROR(IF(ISBLANK(VLOOKUP(TEXT($B36,)&\" - \"&TEXT($AH$35,),SchemaKK1,3,0)),\"\",VLOOKUP(TEXT($B36,)&\" - \"&TEXT($AH$35,),SchemaKK1,3,0)),\"\")","v":""},{"$f":"IF(AI36=\"\",\"\",IF(AH36>AI36,\"w\",IF(AH36=AI36,\"g\",\"v\")))","v":""},{"$f":"IFERROR(IF(ISBLANK(VLOOKUP(TEXT($B36,)&\" - \"&TEXT($AK$35,),SchemaKK1,2,0)),\"\",VLOOKUP(TEXT($B36,)&\" - \"&TEXT($AK$35,),SchemaKK1,2,0)),\"\")","v":""},{"$f":"IFERROR(IF(ISBLANK(VLOOKUP(TEXT($B36,)&\" - \"&TEXT($AK$35,),SchemaKK1,3,0)),\"\",VLOOKUP(TEXT($B36,)&\" - \"&TEXT($AK$35,),SchemaKK1,3,0)),\"\")","v":""},{"$f":"IF(AL36=\"\",\"\",IF(AK36>AL36,\"w\",IF(AK36=AL36,\"g\",\"v\")))","v":""},{"$f":"IFERROR(IF(ISBLANK(VLOOKUP(TEXT($B36,)&\" - \"&TEXT($AN$35,),SchemaKK1,2,0)),\"\",VLOOKUP(TEXT($B36,)&\" - \"&TEXT($AN$35,),SchemaKK1,2,0)),\"\")","v":""},{"$f":"IFERROR(IF(ISBLANK(VLOOKUP(TEXT($B36,)&\" - \"&TEXT($AN$35,),SchemaKK1,3,0)),\"\",VLOOKUP(TEXT($B36,)&\" - \"&TEXT($AN$35,),SchemaKK1,3,0)),\"\")","v":""},{"$f":"IF(AO36=\"\",\"\",IF(AN36>AO36,\"w\",IF(AN36=AO36,\"g\",\"v\")))","v":""},{"$f":"IFERROR(IF(ISBLANK(VLOOKUP(TEXT($B36,)&\" - \"&TEXT($AQ$35,),SchemaKK1,2,0)),\"\",VLOOKUP(TEXT($B36,)&\" - \"&TEXT($AQ$35,),SchemaKK1,2,0)),\"\")","v":""},{"$f":"IFERROR(IF(ISBLANK(VLOOKUP(TEXT($B36,)&\" - \"&TEXT($AQ$35,),SchemaKK1,3,0)),\"\",VLOOKUP(TEXT($B36,)&\" - \"&TEXT($AQ$35,),SchemaKK1,3,0)),\"\")","v":""},{"$f":"IF(AR36=\"\",\"\",IF(AQ36>AR36,\"w\",IF(AQ36=AR36,\"g\",\"v\")))","v":""},{"$f":"IFERROR(IF(ISBLANK(VLOOKUP(TEXT($B36,)&\" - \"&TEXT($AT$35,),SchemaKK1,2,0)),\"\",VLOOKUP(TEXT($B36,)&\" - \"&TEXT($AT$35,),SchemaKK1,2,0)),\"\")","v":""},{"$f":"IFERROR(IF(ISBLANK(VLOOKUP(TEXT($B36,)&\" - \"&TEXT($AT$35,),SchemaKK1,3,0)),\"\",VLOOKUP(TEXT($B36,)&\" - \"&TEXT($AT$35,),SchemaKK1,3,0)),\"\")","v":""},{"$f":"IF(AU36=\"\",\"\",IF(AT36>AU36,\"w\",IF(AT36=AU36,\"g\",\"v\")))","v":""},{"$f":"IFERROR(IF(ISBLANK(VLOOKUP(TEXT($B36,)&\" - \"&TEXT($AW$35,),SchemaKK1,2,0)),\"\",VLOOKUP(TEXT($B36,)&\" - \"&TEXT($AW$35,),SchemaKK1,2,0)),\"\")","v":""},{"$f":"IFERROR(IF(ISBLANK(VLOOKUP(TEXT($B36,)&\" - \"&TEXT($AW$35,),SchemaKK1,3,0)),\"\",VLOOKUP(TEXT($B36,)&\" - \"&TEXT($AW$35,),SchemaKK1,3,0)),\"\")","v":""},{"$f":"IF(AX36=\"\",\"\",IF(AW36>AX36,\"w\",IF(AW36=AX36,\"g\",\"v\")))","v":""},{"$f":"IFERROR(IF(ISBLANK(VLOOKUP(TEXT($B36,)&\" - \"&TEXT($AZ$35,),SchemaKK1,2,0)),\"\",VLOOKUP(TEXT($B36,)&\" - \"&TEXT($AZ$35,),SchemaKK1,2,0)),\"\")","v":""},{"$f":"IFERROR(IF(ISBLANK(VLOOKUP(TEXT($B36,)&\" - \"&TEXT($AZ$35,),SchemaKK1,3,0)),\"\",VLOOKUP(TEXT($B36,)&\" - \"&TEXT($AZ$35,),SchemaKK1,3,0)),\"\")","v":""},{"$f":"IF(BA36=\"\",\"\",IF(AZ36>BA36,\"w\",IF(AZ36=BA36,\"g\",\"v\")))","v":""},{"$f":"IFERROR(IF(ISBLANK(VLOOKUP(TEXT($B36,)&\" - \"&TEXT($BC$35,),SchemaKK1,2,0)),\"\",VLOOKUP(TEXT($B36,)&\" - \"&TEXT($BC$35,),SchemaKK1,2,0)),\"\")","v":""},{"$f":"IFERROR(IF(ISBLANK(VLOOKUP(TEXT($B36,)&\" - \"&TEXT($BC$35,),SchemaKK1,3,0)),\"\",VLOOKUP(TEXT($B36,)&\" - \"&TEXT($BC$35,),SchemaKK1,3,0)),\"\")","v":""},{"$f":"IF(BD36=\"\",\"\",IF(BC36>BD36,\"w\",IF(BC36=BD36,\"g\",\"v\")))","v":""},{"$f":"IFERROR(IF(ISBLANK(VLOOKUP(TEXT($B36,)&\" - \"&TEXT($BF$35,),SchemaKK1,2,0)),\"\",VLOOKUP(TEXT($B36,)&\" - \"&TEXT($BF$35,),SchemaKK1,2,0)),\"\")","v":""},{"$f":"IFERROR(IF(ISBLANK(VLOOKUP(TEXT($B36,)&\" - \"&TEXT($BF$35,),SchemaKK1,3,0)),\"\",VLOOKUP(TEXT($B36,)&\" - \"&TEXT($BF$35,),SchemaKK1,3,0)),\"\")","v":""},{"$f":"IF(BG36=\"\",\"\",IF(BF36>BG36,\"w\",IF(BF36=BG36,\"g\",\"v\")))","v":""},{"$f":"IFERROR(IF(ISBLANK(VLOOKUP(TEXT($B36,)&\" - \"&TEXT($BI$35,),SchemaKK1,2,0)),\"\",VLOOKUP(TEXT($B36,)&\" - \"&TEXT($BI$35,),SchemaKK1,2,0)),\"\")","v":""},{"$f":"IFERROR(IF(ISBLANK(VLOOKUP(TEXT($B36,)&\" - \"&TEXT($BI$35,),SchemaKK1,3,0)),\"\",VLOOKUP(TEXT($B36,)&\" - \"&TEXT($BI$35,),SchemaKK1,3,0)),\"\")","v":""},{"$f":"IF(BJ36=\"\",\"\",IF(BI36>BJ36,\"w\",IF(BI36=BJ36,\"g\",\"v\")))","v":""},{"$f":"COUNTIF(F36:BK36,\"w\")","v":0},{"$f":"COUNTIF(F36:BK36,\"g\")","v":0},{"$f":"COUNTIF(F36:BK36,\"v\")","v":0},{"$f":"SUM(D36,G36,J36,M36,P36,S36,V36,Y36,AB36,AE36,AH36,AK36,AN36,AQ36,AT36,AW36,AZ36,BC36,BF36,BI36)","v":0},{"$f":"SUM(E36,H36,K36,N36,Q36,T36,W36,Z36,AC36,AF36,AI36,AL36,AO36,AR36,AU36,AX36,BA36,BD36,BG36,BJ36)","v":0},null,{"$f":"RANK(CC36,$CC$36:$CC$55)","v":1},"Almere City FC",{"$f":"SUM(BU36:BW36)","v":0},{"$f":"INDEX($BL$36:$BL$55,MATCH(BS36,$B$36:$B$55,0))+INDEX($D$57:$BJ$57,MATCH(BS36,$D$35:$BJ$35,0))","v":0},{"$f":"INDEX($BM$36:$BM$55,MATCH(BS36,$B$36:$B$55,0))+INDEX($D$58:$BJ$58,MATCH(BS36,$D$35:$BJ$35,0))","v":0},{"$f":"INDEX($BN$36:$BN$55,MATCH(BS36,$B$36:$B$55,0))+INDEX($D$59:$BJ$59,MATCH(BS36,$D$35:$BJ$35,0))","v":0},null,{"$f":"(BU36*3)+BV36+BX36","v":0},{"$f":"CA36-CB36","v":0},{"$f":"INDEX($BO$36:$BO$55,MATCH(BS36,$B$36:$B$55,0))+INDEX($D$60:$BJ$60,MATCH(BS36,$D$35:$BJ$35,0))","v":0},{"$f":"INDEX($BP$36:$BP$55,MATCH(BS36,$B$36:$B$55,0))+INDEX($D$61:$BJ$61,MATCH(BS36,$D$35:$BJ$35,0))","v":0},{"$f":"VALUE(TEXT(BY36,\"000\")&TEXT(100+BZ36,\"000\")&TEXT(CA36,\"000\")&TEXT(100-BT36,\"00\")&TEXT(COUNTIF($BS$36:$BS$55,\">=\"&BS36),\"00\"))","v":10000010020}]
[null,{"$f":"BS37","v":"FC Den Bosch"},null,{"$f":"IFERROR(IF(ISBLANK(VLOOKUP(TEXT($B37,)&\" - \"&TEXT($D$35,),SchemaKK1,2,0)),\"\",VLOOKUP(TEXT($B37,)&\" - \"&TEXT($D$35,),SchemaKK1,2,0)),\"\")","v":""},{"$f":"IFERROR(IF(ISBLANK(VLOOKUP(TEXT($B37,)&\" - \"&TEXT($D$35,),SchemaKK1,3,0)),\"\",VLOOKUP(TEXT($B37,)&\" - \"&TEXT($D$35,),SchemaKK1,3,0)),\"\")","v":""},{"$f":"IF(E37=\"\",\"\",IF(D37>E37,\"w\",IF(D37=E37,\"g\",\"v\")))","v":""},null,null,null,{"$f":"IFERROR(IF(ISBLANK(VLOOKUP(TEXT($B37,)&\" - \"&TEXT($J$35,),SchemaKK1,2,0)),\"\",VLOOKUP(TEXT($B37,)&\" - \"&TEXT($J$35,),SchemaKK1,2,0)),\"\")","v":""},{"$f":"IFERROR(IF(ISBLANK(VLOOKUP(TEXT($B37,)&\" - \"&TEXT($J$35,),SchemaKK1,3,0)),\"\",VLOOKUP(TEXT($B37,)&\" - \"&TEXT($J$35,),SchemaKK1,3,0)),\"\")","v":""},"",{"$f":"IFERROR(IF(ISBLANK(VLOOKUP(TEXT($B37,)&\" - \"&TEXT($M$35,),SchemaKK1,2,0)),\"\",VLOOKUP(TEXT($B37,)&\" - \"&TEXT($M$35,),SchemaKK1,2,0)),\"\")","v":""},{"$f":"IFERROR(IF(ISBLANK(VLOOKUP(TEXT($B37,)&\" - \"&TEXT($M$35,),SchemaKK1,3,0)),\"\",VLOOKUP(TEXT($B37,)&\" - \"&TEXT($M$35,),SchemaKK1,3,0)),\"\")","v":""},"",{"$f":"IFERROR(IF(ISBLANK(VLOOKUP(TEXT($B37,)&\" - \"&TEXT($P$35,),SchemaKK1,2,0)),\"\",VLOOKUP(TEXT($B37,)&\" - \"&TEXT($P$35,),SchemaKK1,2,0)),\"\")","v":""},{"$f":"IFERROR(IF(ISBLANK(VLOOKUP(TEXT($B37,)&\" - \"&TEXT($P$35,),SchemaKK1,3,0)),\"\",VLOOKUP(TEXT($B37,)&\" - \"&TEXT($P$35,),SchemaKK1,3,0)),\"\")","v":""},"",{"$f":"IFERROR(IF(ISBLANK(VLOOKUP(TEXT($B37,)&\" - \"&TEXT($S$35,),SchemaKK1,2,0)),\"\",VLOOKUP(TEXT($B37,)&\" - \"&TEXT($S$35,),SchemaKK1,2,0)),\"\")","v":""},{"$f":"IFERROR(IF(ISBLANK(VLOOKUP(TEXT($B37,)&\" - \"&TEXT($S$35,),SchemaKK1,3,0)),\"\",VLOOKUP(TEXT($B37,)&\" - \"&TEXT($S$35,),SchemaKK1,3,0)),\"\")","v":""},"","","","","","","","","","","","","","","","","","","","","","","","","","","","","","","","","","","","","","","","","","","",0,0,0,0,0,null,2,"FC Den Bosch",0,0,0,0,null,0,0,0,0,10000010019]
[null,"FC Dordrecht",null,"","","",{"$f":"IFERROR(IF(ISBLANK(VLOOKUP(TEXT($B38,)&\" - \"&TEXT($G$35,),SchemaKK1,2,0)),\"\",VLOOKUP(TEXT($B38,)&\" - \"&TEXT($G$35,),SchemaKK1,2,0)),\"\")","v":""},{"$f":"IFERROR(IF(ISBLANK(VLOOKUP(TEXT($B38,)&\" - \"&TEXT($G$35,),SchemaKK1,3,0)),\"\",VLOOKUP(TEXT($B38,)&\" - \"&TEXT($G$35,),SchemaKK1,3,0)),\"\")","v":""},"",null,null,null,{"$f":"IFERROR(IF(ISBLANK(VLOOKUP(TEXT($B38,)&\" - \"&TEXT($M$35,),SchemaKK1,2,0)),\"\",VLOOKUP(TEXT($B38,)&\" - \"&TEXT($M$35,),SchemaKK1,2,0)),\"\")","v":""},{"$f":"IFERROR(IF(ISBLANK(VLOOKUP(TEXT($B38,)&\" - \"&TEXT($M$35,),SchemaKK1,3,0)),\"\",VLOOKUP(TEXT($B38,)&\" - \"&TEXT($M$35,),SchemaKK1,3,0)),\"\")","v":""},"",{"$f":"IFERROR(IF(ISBLANK(VLOOKUP(TEXT($B38,)&\" - \"&TEXT($P$35,),SchemaKK1,2,0)),\"\",VLOOKUP(TEXT($B38,)&\" - \"&TEXT($P$35,),SchemaKK1,2,0)),\"\")","v":""},{"$f":"IFERROR(IF(ISBLANK(VLOOKUP(TEXT($B38,)&\" - \"&TEXT($P$35,),SchemaKK1,3,0)),\"\",VLOOKUP(TEXT($B38,)&\" - \"&TEXT($P$35,),SchemaKK1,3,0)),\"\")","v":""},"",{"$f":"IFERROR(IF(ISBLANK(VLOOKUP(TEXT($B38,)&\" - \"&TEXT($S$35,),SchemaKK1,2,0)),\"\",VLOOKUP(TEXT($B38,)&\" - \"&TEXT($S$35,),SchemaKK1,2,0)),\"\")","v":""},{"$f":"IFERROR(IF(ISBLANK(VLOOKUP(TEXT($B38,)&\" - \"&TEXT($S$35,),SchemaKK1,3,0)),\"\",VLOOKUP(TEXT($B38,)&\" - \"&TEXT($S$35,),SchemaKK1,3,0)),\"\")","v":""},"","","","","","","","","","","","","","","","","","","","","","","","","","","","","","","","","","","","","","","","","","","",0,0,0,0,0,null,3,"FC Dordrecht",0,0,0,0,null,0,0,0,0,10000010018]
[null,"FC Eindhoven",null,"","","","","","",{"$f":"IFERROR(IF(ISBLANK(VLOOKUP(TEXT($B39,)&\" - \"&TEXT($J$35,),SchemaKK1,2,0)),\"\",VLOOKUP(TEXT($B39,)&\" - \"&TEXT($J$35,),SchemaKK1,2,0)),\"\")","v":""},{"$f":"IFERROR(IF(ISBLANK(VLOOKUP(TEXT($B39,)&\" - \"&TEXT($J$35,),SchemaKK1,3,0)),\"\",VLOOKUP(TEXT($B39,)&\" - \"&TEXT($J$35,),SchemaKK1,3,0)),\"\")","v":""},"",null,null,null,{"$f":"IFERROR(IF(ISBLANK(VLOOKUP(TEXT($B39,)&\" - \"&TEXT($P$35,),SchemaKK1,2,0)),\"\",VLOOKUP(TEXT($B39,)&\" - \"&TEXT($P$35,),SchemaKK1,2,0)),\"\")","v":""},{"$f":"IFERROR(IF(ISBLANK(VLOOKUP(TEXT($B39,)&\" - \"&TEXT($P$35,),SchemaKK1,3,0)),\"\",VLOOKUP(TEXT($B39,)&\" - \"&TEXT($P$35,),SchemaKK1,3,0)),\"\")","v":""},"",{"$f":"IFERROR(IF(ISBLANK(VLOOKUP(TEXT($B39,)&\" - \"&TEXT($S$35,),SchemaKK1,2,0)),\"\",VLOOKUP(TEXT($B39,)&\" - \"&TEXT($S$35,),SchemaKK1,2,0)),\"\")","v":""},{"$f":"IFERROR(IF(ISBLANK(VLOOKUP(TEXT($B39,)&\" - \"&TEXT($S$35,),SchemaKK1,3,0)),\"\",VLOOKUP(TEXT($B39,)&\" - \"&TEXT($S$35,),SchemaKK1,3,0)),\"\")","v":""},"","","","","","","","","","","","","","","","","","","","","","","","","","","","","","","","","","","","","","","","","","","",0,0,0,0,0,null,4,"FC Eindhoven",0,0,0,0,null,0,0,0,0,10000010017]
[null,"FC Twente",null,"","","","","","","","","",{"$f":"IFERROR(IF(ISBLANK(VLOOKUP(TEXT($B40,)&\" - \"&TEXT($M$35,),SchemaKK1,2,0)),\"\",VLOOKUP(TEXT($B40,)&\" - \"&TEXT($M$35,),SchemaKK1,2,0)),\"\")","v":""},{"$f":"IFERROR(IF(ISBLANK(VLOOKUP(TEXT($B40,)&\" - \"&TEXT($M$35,),SchemaKK1,3,0)),\"\",VLOOKUP(TEXT($B40,)&\" - \"&TEXT($M$35,),SchemaKK1,3,0)),\"\")","v":""},"",null,null,null,{"$f":"IFERROR(IF(ISBLANK(VLOOKUP(TEXT($B40,)&\" - \"&TEXT($S$35,),SchemaKK1,2,0)),\"\",VLOOKUP(TEXT($B40,)&\" - \"&TEXT($S$35,),SchemaKK1,2,0)),\"\")","v":""},{"$f":"IFERROR(IF(ISBLANK(VLOOKUP(TEXT($B40,)&\" - \"&TEXT($S$35,),SchemaKK1,3,0)),\"\",VLOOKUP(TEXT($B40,)&\" - \"&TEXT($S$35,),SchemaKK1,3,0)),\"\")","v":""},"","","","","","","","","","","","","","","","","","","","","","","","","","","","","","","","","","","","","","","","","","","",0,0,0,0,0,null,5,"FC Twente",0,0,0,0,null,0,0,0,0,10000010016]
[null,"FC Volendam",null,"","","","","","","","","","","","",{"$f":"IFERROR(IF(ISBLANK(VLOOKUP(TEXT($B41,)&\" - \"&TEXT($P$35,),SchemaKK1,2,0)),\"\",VLOOKUP(TEXT($B41,)&\" - \"&TEXT($P$35,),SchemaKK1,2,0)),\"\")","v":""},{"$f":"IFERROR(IF(ISBLANK(VLOOKUP(TEXT($B41,)&\" - \"&TEXT($P$35,),SchemaKK1,3,0)),\"\",VLOOKUP(TEXT($B41,)&\" - \"&TEXT($P$35,),SchemaKK1,3,0)),\"\")","v":""},"",null,null,null,"","","","","","","","","","","","","","","","","","","","","","","","","","","","","","","","","","","","","","","","","","",0,0,0,0,0,null,6,"FC Volendam",0,0,0,0,null,0,0,0,0,10000010015]
[null,"Go Ahead Eagles",null,"","","","","","","","","","","","","","","",{"$f":"IFERROR(IF(ISBLANK(VLOOKUP(TEXT($B42,)&\" - \"&TEXT($S$35,),SchemaKK1,2,0)),\"\",VLOOKUP(TEXT($B42,)&\" - \"&TEXT($S$35,),SchemaKK1,2,0)),\"\")","v":""},{"$f":"IFERROR(IF(ISBLANK(VLOOKUP(TEXT($B42,)&\" - \"&TEXT($S$35,),SchemaKK1,3,0)),\"\",VLOOKUP(TEXT($B42,)&\" - \"&TEXT($S$35,),SchemaKK1,3,0)),\"\")","v":""},"",null,null,null,"","","","","","","","","","","","","","","","","","","","","","","","","","","","","","","","","","","","","","","",0,0,0,0,0,null,7,"Go Ahead Eagles",0,0,0,0,null,0,0,0,0,10000010014]
[null,"Helmond Sport",null,"","","","","","","","","","","","","","","","","","",{"$f":"IFERROR(IF(ISBLANK(VLOOKUP(TEXT($B43,)&\" - \"&TEXT($V$35,),SchemaKK1,2,0)),\"\",VLOOKUP(TEXT($B43,)&\" - \"&TEXT($V$35,),SchemaKK1,2,0)),\"\")","v":""},{"$f":"IFERROR(IF(ISBLANK(VLOOKUP(TEXT($B43,)&\" - \"&TEXT($V$35,),SchemaKK1,3,0)),\"\",VLOOKUP(TEXT($B43,)&\" - \"&TEXT($V$35,),SchemaKK1,3,0)),\"\")","v":""},"",null,null,null,"","","","","","","","","","","","","","","","","","","","","","","","","","","","","","","","","","","","",0,0,0,0,0,null,8,"Helmond Sport",0,0,0,0,null,0,0,0,0,10000010013]
[null,"Jong Ajax",null,"","","","","","","","","","","","","","","","","","","","","",{"$f":"IFERROR(IF(ISBLANK(VLOOKUP(TEXT($B44,)&\" - \"&TEXT($Y$35,),SchemaKK1,2,0)),\"\",VLOOKUP(TEXT($B44,)&\" - \"&TEXT($Y$35,),SchemaKK1,2,0)),\"\")","v":""},{"$f":"IFERROR(IF(ISBLANK(VLOOKUP(TEXT($B44,)&\" - \"&TEXT($Y$35,),SchemaKK1,3,0)),\"\",VLOOKUP(TEXT($B44,)&\" - \"&TEXT($Y$35,),SchemaKK1,3,0)),\"\")","v":""},"",null,null,null,"","","","","","","","","","","","","","","","","","","","","","","","","","","","","","","","","",0,0,0,0,0,null,9,"Jong Ajax",0,0,0,0,null,0,0,0,0,10000010012]
[null,"Jong AZ Alkmaar",null,"","","","","","","","","","","","","","","","","","","","","","","","",{"$f":"IFERROR(IF(ISBLANK(VLOOKUP(TEXT($B45,)&\" - \"&TEXT($AB$35,),SchemaKK1,2,0)),\"\",VLOOKUP(TEXT($B45,)&\" - \"&TEXT($AB$35,),SchemaKK1,2,0)),\"\")","v":""},{"$f":"IFERROR(IF(ISBLANK(VLOOKUP(TEXT($B45,)&\" - \"&TEXT($AB$35,),SchemaKK1,3,0)),\"\",VLOOKUP(TEXT($B45,)&\" - \"&TEXT($AB$35,),SchemaKK1,3,0)),\"\")","v":""},"",null,null,null,"","","","","","","","","","","","","","","","","","","","","","","","","","","","","","",0,0,0,0,0,null,10,"Jong AZ Alkmaar",0,0,0,0,null,0,0,0,0,10000010011]
[null,"Jong FC Utrecht",null,"","","","","","","","","","","","","","","","","","","","","","","","","","","",{"$f":"IFERROR(IF(ISBLANK(VLOOKUP(TEXT($B46,)&\" - \"&TEXT($AE$35,),SchemaKK1,2,0)),\"\",VLOOKUP(TEXT($B46,)&\" - \"&TEXT($AE$35,),SchemaKK1,2,0)),\"\")","v":""},{"$f":"IFERROR(IF(ISBLANK(VLOOKUP(TEXT($B46,)&\" - \"&TEXT($AE$35,),SchemaKK1,3,0)),\"\",VLOOKUP(TEXT($B46,)&\" - \"&TEXT($AE$35,),SchemaKK1,3,0)),\"\")","v":""},"",null,null,null,"","","","","","","","","","","","","","","","","","","","","","","","","","","",0,0,0,0,0,null,11,"Jong FC Utrecht",0,0,0,0,null,0,0,0,0,10000010010]
[null,"Jong PSV",null,"","","","","","","","","","","","","","","","","","","","","","","","","","","","","","",{"$f":"IFERROR(IF(ISBLANK(VLOOKUP(TEXT($B47,)&\" - \"&TEXT($AH$35,),SchemaKK1,2,0)),\"\",VLOOKUP(TEXT($B47,)&\" - \"&TEXT($AH$35,),SchemaKK1,2,0)),\"\")","v":""},{"$f":"IFERROR(IF(ISBLANK(VLOOKUP(TEXT($B47,)&\" - \"&TEXT($AH$35,),SchemaKK1,3,0)),\"\",VLOOKUP(TEXT($B47,)&\" - \"&TEXT($AH$35,),SchemaKK1,3,0)),\"\")","v":""},"",null,null,null,"","","","","","","","","","","","","","","","","","","","","","","","",0,0,0,0,0,null,12,"Jong PSV",0,0,0,0,null,0,0,0,0,10000010009]
[null,"MVV Maastricht",null,"","","","","","","","","","","","","","","","","","","","","","","","","","","","","","","","","",{"$f":"IFERROR(IF(ISBLANK(VLOOKUP(TEXT($B48,)&\" - \"&TEXT($AK$35,),SchemaKK1,2,0)),\"\",VLOOKUP(TEXT($B48,)&\" - \"&TEXT($AK$35,),SchemaKK1,2,0)),\"\")","v":""},{"$f":"IFERROR(IF(ISBLANK(VLOOKUP(TEXT($B48,)&\" - \"&TEXT($AK$35,),SchemaKK1,3,0)),\"\",VLOOKUP(TEXT($B48,)&\" - \"&TEXT($AK$35,),SchemaKK1,3,0)),\"\")","v":""},"",null,null,null,"","","","","","","","","","","","","","","","","","","","","",0,0,0,0,0,null,13,"MVV Maastricht",0,0,0,0,null,0,0,0,0,10000010008]
[null,"NEC Nijmegen",null,"","","","","","","","","","","","","","","","","","","","","","","","","","","","","","","","","","","","",{"$f":"IFERROR(IF(ISBLANK(VLOOKUP(TEXT($B49,)&\" - \"&TEXT($AN$35,),SchemaKK1,2,0)),\"\",VLOOKUP(TEXT($B49,)&\" - \"&TEXT($AN$35,),SchemaKK1,2,0)),\"\")","v":""},{"$f":"IFERROR(IF(ISBLANK(VLOOKUP(TEXT($B49,)&\" - \"&TEXT($AN$35,),SchemaKK1,3,0)),\"\",VLOOKUP(TEXT($B49,)&\" - \"&TEXT($AN$35,),SchemaKK1,3,0)),\"\")","v":""},"",null,null,null,"","","","","","","","","","","","","","","","","","",0,0,0,0,0,null,14,"NEC Nijmegen",0,0,0,0,null,0,0,0,0,10000010007]
[null,"RKC Waalwijk",null,"","","","","","","","","","","","","","","","","","","","","","","","","","","","","","","","","","","","","","","",{"$f":"IFERROR(IF(ISBLANK(VLOOKUP(TEXT($B50,)&\" - \"&TEXT($AQ$35,),SchemaKK1,2,0)),\"\",VLOOKUP(TEXT($B50,)&\" - \"&TEXT($AQ$35,),SchemaKK1,2,0)),\"\")","v":""},{"$f":"IFERROR(IF(ISBLANK(VLOOKUP(TEXT($B50,)&\" - \"&TEXT($AQ$35,),SchemaKK1,3,0)),\"\",VLOOKUP(TEXT($B50,)&\" - \"&TEXT($AQ$35,),SchemaKK1,3,0)),\"\")","v":""},"",null,null,null,"","","","","","","","","","","","","","","",0,0,0,0,0,null,15,"RKC Waalwijk",0,0,0,0,null,0,0,0,0,10000010006]
[null,"Roda JC Kerkrade",null,"","","","","","","","","","","","","","","","","","","","","","","","","","","","","","","","","","","","","","","","","","",{"$f":"IFERROR(IF(ISBLANK(VLOOKUP(TEXT($B51,)&\" - \"&TEXT($AT$35,),SchemaKK1,2,0)),\"\",VLOOKUP(TEXT($B51,)&\" - \"&TEXT($AT$35,),SchemaKK1,2,0)),\"\")","v":""},{"$f":"IFERROR(IF(ISBLANK(VLOOKUP(TEXT($B51,)&\" - \"&TEXT($AT$35,),SchemaKK1,3,0)),\"\",VLOOKUP(TEXT($B51,)&\" - \"&TEXT($AT$35,),SchemaKK1,3,0)),\"\")","v":""},"",null,null,null,"","","","","","","","","","","","",0,0,0,0,0,null,16,"Roda JC Kerkrade",0,0,0,0,null,0,0,0,0,10000010005]
[null,"SC Cambuur",null,"","","","","","","","","","","","","","","","","","","","","","","","","","","","","","","","","","","","","","","","","","",{"$f":"IFERROR(IF(ISBLANK(VLOOKUP(TEXT($B52,)&\" - \"&TEXT($AT$35,),SchemaKK1,2,0)),\"\",VLOOKUP(TEXT($B52,)&\" - \"&TEXT($AT$35,),SchemaKK1,2,0)),\"\")","v":""},{"$f":"IFERROR(IF(ISBLANK(VLOOKUP(TEXT($B52,)&\" - \"&TEXT($AT$35,),SchemaKK1,3,0)),\"\",VLOOKUP(TEXT($B52,)&\" - \"&TEXT($AT$35,),SchemaKK1,3,0)),\"\")","v":""},"",{"$f":"IFERROR(IF(ISBLANK(VLOOKUP(TEXT($B52,)&\" - \"&TEXT($AW$35,),SchemaKK1,2,0)),\"\",VLOOKUP(TEXT($B52,)&\" - \"&TEXT($AW$35,),SchemaKK1,2,0)),\"\")","v":""},{"$f":"IFERROR(IF(ISBLANK(VLOOKUP(TEXT($B52,)&\" - \"&TEXT($AW$35,),SchemaKK1,3,0)),\"\",VLOOKUP(TEXT($B52,)&\" - \"&TEXT($AW$35,),SchemaKK1,3,0)),\"\")","v":""},"",null,null,null,"","","","","","","","","",0,0,0,0,0,null,17,"SC Cambuur",0,0,0,0,null,0,0,0,0,10000010004]
[null,"SC Telstar",null,"","","","","","","","","","","","","","","","","","","","","","","","","","","","","","","","","","","","","","","","","","",{"$f":"IFERROR(IF(ISBLANK(VLOOKUP(TEXT($B53,)&\" - \"&TEXT($AT$35,),SchemaKK1,2,0)),\"\",VLOOKUP(TEXT($B53,)&\" - \"&TEXT($AT$35,),SchemaKK1,2,0)),\"\")","v":""},{"$f":"IFERROR(IF(ISBLANK(VLOOKUP(TEXT($B53,)&\" - \"&TEXT($AT$35,),SchemaKK1,3,0)),\"\",VLOOKUP(TEXT($B53,)&\" - \"&TEXT($AT$35,),SchemaKK1,3,0)),\"\")","v":""},"",{"$f":"IFERROR(IF(ISBLANK(VLOOKUP(TEXT($B53,)&\" - \"&TEXT($AW$35,),SchemaKK1,2,0)),\"\",VLOOKUP(TEXT($B53,)&\" - \"&TEXT($AW$35,),SchemaKK1,2,0)),\"\")","v":""},{"$f":"IFERROR(IF(ISBLANK(VLOOKUP(TEXT($B53,)&\" - \"&TEXT($AW$35,),SchemaKK1,3,0)),\"\",VLOOKUP(TEXT($B53,)&\" - \"&TEXT($AW$35,),SchemaKK1,3,0)),\"\")","v":""},"",{"$f":"IFERROR(IF(ISBLANK(VLOOKUP(TEXT($B53,)&\" - \"&TEXT($AZ$35,),SchemaKK1,2,0)),\"\",VLOOKUP(TEXT($B53,)&\" - \"&TEXT($AZ$35,),SchemaKK1,2,0)),\"\")","v":""},{"$f":"IFERROR(IF(ISBLANK(VLOOKUP(TEXT($B53,)&\" - \"&TEXT($AZ$35,),SchemaKK1,3,0)),\"\",VLOOKUP(TEXT($B53,)&\" - \"&TEXT($AZ$35,),SchemaKK1,3,0)),\"\")","v":""},"",null,null,null,"","","","","","",0,0,0,0,0,null,18,"SC Telstar",0,0,0,0,null,0,0,0,0,10000010003]
[null,"Sparta Rotterdam",null,"","","","","","","","","","","","","","","","","","","","","","","","","","","","","","","","","","","","","","","","","","",{"$f":"IFERROR(IF(ISBLANK(VLOOKUP(TEXT($B54,)&\" - \"&TEXT($AT$35,),SchemaKK1,2,0)),\"\",VLOOKUP(TEXT($B54,)&\" - \"&TEXT($AT$35,),SchemaKK1,2,0)),\"\")","v":""},{"$f":"IFERROR(IF(ISBLANK(VLOOKUP(TEXT($B54,)&\" - \"&TEXT($AT$35,),SchemaKK1,3,0)),\"\",VLOOKUP(TEXT($B54,)&\" - \"&TEXT($AT$35,),SchemaKK1,3,0)),\"\")","v":""},"",{"$f":"IFERROR(IF(ISBLANK(VLOOKUP(TEXT($B54,)&\" - \"&TEXT($AW$35,),SchemaKK1,2,0)),\"\",VLOOKUP(TEXT($B54,)&\" - \"&TEXT($AW$35,),SchemaKK1,2,0)),\"\")","v":""},{"$f":"IFERROR(IF(ISBLANK(VLOOKUP(TEXT($B54,)&\" - \"&TEXT($AW$35,),SchemaKK1,3,0)),\"\",VLOOKUP(TEXT($B54,)&\" - \"&TEXT($AW$35,),SchemaKK1,3,0)),\"\")","v":""},"",{"$f":"IFERROR(IF(ISBLANK(VLOOKUP(TEXT($B54,)&\" - \"&TEXT($AZ$35,),SchemaKK1,2,0)),\"\",VLOOKUP(TEXT($B54,)&\" - \"&TEXT($AZ$35,),SchemaKK1,2,0)),\"\")","v":""},{"$f":"IFERROR(IF(ISBLANK(VLOOKUP(TEXT($B54,)&\" - \"&TEXT($AZ$35,),SchemaKK1,3,0)),\"\",VLOOKUP(TEXT($B54,)&\" - \"&TEXT($AZ$35,),SchemaKK1,3,0)),\"\")","v":""},"",{"$f":"IFERROR(IF(ISBLANK(VLOOKUP(TEXT($B54,)&\" - \"&TEXT($BC$35,),SchemaKK1,2,0)),\"\",VLOOKUP(TEXT($B54,)&\" - \"&TEXT($BC$35,),SchemaKK1,2,0)),\"\")","v":""},{"$f":"IFERROR(IF(ISBLANK(VLOOKUP(TEXT($B54,)&\" - \"&TEXT($BC$35,),SchemaKK1,3,0)),\"\",VLOOKUP(TEXT($B54,)&\" - \"&TEXT($BC$35,),SchemaKK1,3,0)),\"\")","v":""},"",null,null,null,"","","",0,0,0,0,0,null,19,"Sparta Rotterdam",0,0,0,0,null,0,0,0,0,10000010002]
[null,"TOP Oss",null,"","","","","","","","","","","","","","","","","","","","","","","","","","","","","","","","","","","","","","","","","","",{"$f":"IFERROR(IF(ISBLANK(VLOOKUP(TEXT($B55,)&\" - \"&TEXT($AT$35,),SchemaKK1,2,0)),\"\",VLOOKUP(TEXT($B55,)&\" - \"&TEXT($AT$35,),SchemaKK1,2,0)),\"\")","v":""},{"$f":"IFERROR(IF(ISBLANK(VLOOKUP(TEXT($B55,)&\" - \"&TEXT($AT$35,),SchemaKK1,3,0)),\"\",VLOOKUP(TEXT($B55,)&\" - \"&TEXT($AT$35,),SchemaKK1,3,0)),\"\")","v":""},"",{"$f":"IFERROR(IF(ISBLANK(VLOOKUP(TEXT($B55,)&\" - \"&TEXT($AW$35,),SchemaKK1,2,0)),\"\",VLOOKUP(TEXT($B55,)&\" - \"&TEXT($AW$35,),SchemaKK1,2,0)),\"\")","v":""},{"$f":"IFERROR(IF(ISBLANK(VLOOKUP(TEXT($B55,)&\" - \"&TEXT($AW$35,),SchemaKK1,3,0)),\"\",VLOOKUP(TEXT($B55,)&\" - \"&TEXT($AW$35,),SchemaKK1,3,0)),\"\")","v":""},"",{"$f":"IFERROR(IF(ISBLANK(VLOOKUP(TEXT($B55,)&\" - \"&TEXT($AZ$35,),SchemaKK1,2,0)),\"\",VLOOKUP(TEXT($B55,)&\" - \"&TEXT($AZ$35,),SchemaKK1,2,0)),\"\")","v":""},{"$f":"IFERROR(IF(ISBLANK(VLOOKUP(TEXT($B55,)&\" - \"&TEXT($AZ$35,),SchemaKK1,3,0)),\"\",VLOOKUP(TEXT($B55,)&\" - \"&TEXT($AZ$35,),SchemaKK1,3,0)),\"\")","v":""},"",{"$f":"IFERROR(IF(ISBLANK(VLOOKUP(TEXT($B55,)&\" - \"&TEXT($BC$35,),SchemaKK1,2,0)),\"\",VLOOKUP(TEXT($B55,)&\" - \"&TEXT($BC$35,),SchemaKK1,2,0)),\"\")","v":""},{"$f":"IFERROR(IF(ISBLANK(VLOOKUP(TEXT($B55,)&\" - \"&TEXT($BC$35,),SchemaKK1,3,0)),\"\",VLOOKUP(TEXT($B55,)&\" - \"&TEXT($BC$35,),SchemaKK1,3,0)),\"\")","v":""},"",{"$f":"IFERROR(IF(ISBLANK(VLOOKUP(TEXT($B55,)&\" - \"&TEXT($BF$35,),SchemaKK1,2,0)),\"\",VLOOKUP(TEXT($B55,)&\" - \"&TEXT($BF$35,),SchemaKK1,2,0)),\"\")","v":""},{"$f":"IFERROR(IF(ISBLANK(VLOOKUP(TEXT($B55,)&\" - \"&TEXT($BF$35,),SchemaKK1,3,0)),\"\",VLOOKUP(TEXT($B55,)&\" - \"&TEXT($BF$35,),SchemaKK1,3,0)),\"\")","v":""},"",null,null,null,0,0,0,0,0,null,20,"TOP Oss",0,0,0,0,null,0,0,0,0,10000010001]
[]
[null,"Winst uit",null,{"$f":"COUNTIF(F$36:F$55,\"v\")","v":0},null,null,{"$f":"COUNTIF(I$36:I$55,\"v\")","v":0},null,null,{"$f":"COUNTIF(L$36:L$55,\"v\")","v":0},null,null,{"$f":"COUNTIF(O$36:O$55,\"v\")","v":0},null,null,{"$f":"COUNTIF(R$36:R$55,\"v\")","v":0},null,null,{"$f":"COUNTIF(U$36:U$55,\"v\")","v":0},null,null,{"$f":"COUNTIF(X$36:X$55,\"v\")","v":0},null,null,{"$f":"COUNTIF(AA$36:AA$55,\"v\")","v":0},null,null,{"$f":"COUNTIF(AD$36:AD$55,\"v\")","v":0},null,null,{"$f":"COUNTIF(AG$36:AG$55,\"v\")","v":0},null,null,{"$f":"COUNTIF(AJ$36:AJ$55,\"v\")","v":0},null,null,{"$f":"COUNTIF(AM$36:AM$55,\"v\")","v":0},null,null,{"$f":"COUNTIF(AP$36:AP$55,\"v\")","v":0},null,null,{"$f":"COUNTIF(AS$36:AS$55,\"v\")","v":0},null,null,{"$f":"COUNTIF(AV$36:AV$55,\"v\")","v":0},null,null,{"$f":"COUNTIF(AY$36:AY$55,\"v\")","v":0},null,null,{"$f":"COUNTIF(BB$36:BB$55,\"v\")","v":0},null,null,{"$f":"COUNTIF(BE$36:BE$55,\"v\")","v":0},null,null,{"$f":"COUNTIF(BH$36:BH$55,\"v\")","v":0},null,null,{"$f":"COUNTIF(BK$36:BK$55,\"v\")","v":0},null,null,null,null,null,null,null,null,null,"Periodekampioen of vervanger"]
[null,"Gelijk uit",null,{"$f":"COUNTIF(F$36:F$55,\"g\")","v":0},null,null,{"$f":"COUNTIF(I$36:I$55,\"g\")","v":0},null,null,{"$f":"COUNTIF(L$36:L$55,\"g\")","v":0},null,null,{"$f":"COUNTIF(O$36:O$55,\"g\")","v":0},null,null,{"$f":"COUNTIF(R$36:R$55,\"g\")","v":0},null,null,{"$f":"COUNTIF(U$36:U$55,\"g\")","v":0},null,null,{"$f":"COUNTIF(X$36:X$55,\"g\")","v":0},null,null,{"$f":"COUNTIF(AA$36:AA$55,\"g\")","v":0},null,null,{"$f":"COUNTIF(AD$36:AD$55,\"g\")","v":0},null,null,{"$f":"COUNTIF(AG$36:AG$55,\"g\")","v":0},null,null,{"$f":"COUNTIF(AJ$36:AJ$55,\"g\")","v":0},null,null,{"$f":"COUNTIF(AM$36:AM$55,\"g\")","v":0},null,null,{"$f":"COUNTIF(AP$36:AP$55,\"g\")","v":0},null,null,{"$f":"COUNTIF(AS$36:AS$55,\"g\")","v":0},null,null,{"$f":"COUNTIF(AV$36:AV$55,\"g\")","v":0},null,null,{"$f":"COUNTIF(AY$36:AY$55,\"g\")","v":0},null,null,{"$f":"COUNTIF(BB$36:BB$55,\"g\")","v":0},null,null,{"$f":"COUNTIF(BE$36:BE$55,\"g\")","v":0},null,null,{"$f":"COUNTIF(BH$36:BH$55,\"g\")","v":0},null,null,{"$f":"COUNTIF(BK$36:BK$55,\"g\")","v":0}]
[null,"Verlies uit",null,{"$f":"COUNTIF(F$36:F$55,\"w\")","v":0},null,null,{"$f":"COUNTIF(I$36:I$55,\"w\")","v":0},null,null,{"$f":"COUNTIF(L$36:L$55,\"w\")","v":0},null,null,{"$f":"COUNTIF(O$36:O$55,\"w\")","v":0},null,null,{"$f":"COUNTIF(R$36:R$55,\"w\")","v":0},null,null,{"$f":"COUNTIF(U$36:U$55,\"w\")","v":0},null,null,{"$f":"COUNTIF(X$36:X$55,\"w\")","v":0},null,null,{"$f":"COUNTIF(AA$36:AA$55,\"w\")","v":0},null,null,{"$f":"COUNTIF(AD$36:AD$55,\"w\")","v":0},null,null,{"$f":"COUNTIF(AG$36:AG$55,\"w\")","v":0},null,null,{"$f":"COUNTIF(AJ$36:AJ$55,\"w\")","v":0},null,null,{"$f":"COUNTIF(AM$36:AM$55,\"w\")","v":0},null,null,{"$f":"COUNTIF(AP$36:AP$55,\"w\")","v":0},null,null,{"$f":"COUNTIF(AS$36:AS$55,\"w\")","v":0},null,null,{"$f":"COUNTIF(AV$36:AV$55,\"w\")","v":0},null,null,{"$f":"COUNTIF(AY$36:AY$55,\"w\")","v":0},null,null,{"$f":"COUNTIF(BB$36:BB$55,\"w\")","v":0},null,null,{"$f":"COUNTIF(BE$36:BE$55,\"w\")","v":0},null,null,{"$f":"COUNTIF(BH$36:BH$55,\"w\")","v":0},null,null,{"$f":"COUNTIF(BK$36:BK$55,\"w\")","v":0}]
[null,"Vóór uit",null,{"$f":"SUM(E36:E55)","v":0},null,null,{"$f":"SUM(H36:H55)","v":0},null,null,{"$f":"SUM(K36:K55)","v":0},null,null,{"$f":"SUM(N36:N55)","v":0},null,null,{"$f":"SUM(Q36:Q55)","v":0},null,null,{"$f":"SUM(T36:T55)","v":0},null,null,{"$f":"SUM(W36:W55)","v":0},null,null,{"$f":"SUM(Z36:Z55)","v":0},null,null,{"$f":"SUM(AC36:AC55)","v":0},null,null,{"$f":"SUM(AF36:AF55)","v":0},null,null,{"$f":"SUM(AI36:AI55)","v":0},null,null,{"$f":"SUM(AL36:AL55)","v":0},null,null,{"$f":"SUM(AO36:AO55)","v":0},null,null,{"$f":"SUM(AR36:AR55)","v":0},null,null,{"$f":"SUM(AU36:AU55)","v":0},null,null,{"$f":"SUM(AX36:AX55)","v":0},null,null,{"$f":"SUM(BA36:BA55)","v":0},null,null,{"$f":"SUM(BD36:BD55)","v":0},null,null,{"$f":"SUM(BG36:BG55)","v":0},null,null,{"$f":"SUM(BJ36:BJ55)","v":0}]
[null,"Tegen uit",null,{"$f":"SUM(D36:D55)","v":0},null,null,{"$f":"SUM(G36:G55)","v":0},null,null,{"$f":"SUM(J36:J55)","v":0},null,null,{"$f":"SUM(M36:M55)","v":0},null,null,{"$f":"SUM(P36:P55)","v":0},null,null,{"$f":"SUM(S36:S55)","v":0},null,null,{"$f":"SUM(V36:V55)","v":0},null,null,{"$f":"SUM(Y36:Y55)","v":0},null,null,{"$f":"SUM(AB36:AB55)","v":0},null,null,{"$f":"SUM(AE36:AE55)","v":0},null,null,{"$f":"SUM(AH36:AH55)","v":0},null,null,{"$f":"SUM(AK36:AK55)","v":0},null,null,{"$f":"SUM(AN36:AN55)","v":0},null,null,{"$f":"SUM(AQ36:AQ55)","v":0},null,null,{"$f":"SUM(AT36:AT55)","v":0},null,null,{"$f":"SUM(AW36:AW55)","v":0},null,null,{"$f":"SUM(AZ36:AZ55)","v":0},null,null,{"$f":"SUM(BC36:BC55)","v":0},null,null,{"$f":"SUM(BF36:BF55)","v":0},null,null,{"$f":"SUM(BI36:BI55)","v":0}]
[]
[]
[]
[null,"Periode 2",null,{"$f":"$B$66","v":"Almere City FC"},null,null,{"$f":"$B$67","v":"FC Den Bosch"},null,null,{"$f":"$B$68","v":"FC Dordrecht"},null,null,{"$f":"$B$69","v":"FC Eindhoven"},null,null,{"$f":"$B$70","v":"FC Twente"},null,null,{"$f":"$B$71","v":"FC Volendam"},null,null,{"$f":"$B$72","v":"Go Ahead Eagles"},null,null,{"$f":"$B$73","v":"Helmond Sport"},null,null,{"$f":"$B$74","v":"Jong Ajax"},null,null,{"$f":"$B$75","v":"Jong AZ Alkmaar"},null,null,{"$f":"$B$76","v":"Jong FC Utrecht"},null,null,{"$f":"$B$77","v":"Jong PSV"},null,null,{"$f":"$B$78","v":"MVV Maastricht"},null,null,{"$f":"$B$79","v":"NEC Nijmegen"},null,null,{"$f":"$B$80","v":"RKC Waalwijk"},null,null,{"$f":"$B$81","v":"Roda JC Kerkrade"},null,null,{"$f":"$B$82","v":"SC Cambuur"},null,null,{"$f":"$B$83","v":"SC Telstar"},null,null,{"$f":"$B$84","v":"Sparta Rotterdam"},null,null,{"$f":"$B$85","v":"TOP Oss"},null,null,"Winst thuis","Gelijk thuis","Verlies thuis","Vóór thuis","Tegen thuis",null,"Plaats","Team","Gespeeld","Winst","Gelijk","Verlies","Straf","Punten","Doelsaldo","Vóór","Tegen","Code"]
[null,{"$f":"BS66","v":"Almere City FC"},null,null,null,null,{"$f":"IFERROR(IF(ISBLANK(VLOOKUP(TEXT($B66,)&\" - \"&TEXT($G$65,),SchemaKK2,2,0)),\"\",VLOOKUP(TEXT($B66,)&\" - \"&TEXT($G$65,),SchemaKK2,2,0)),\"\")","v":""},{"$f":"IFERROR(IF(ISBLANK(VLOOKUP(TEXT($B66,)&\" - \"&TEXT($G$65,),SchemaKK2,3,0)),\"\",VLOOKUP(TEXT($B66,)&\" - \"&TEXT($G$65,),SchemaKK2,3,0)),\"\")","v":""},{"$f":"IF(H66=\"\",\"\",IF(G66>H66,\"w\",IF(G66=H66,\"g\",\"v\")))","v":""},{"$f":"IFERROR(IF(ISBLANK(VLOOKUP(TEXT($B66,)&\" - \"&TEXT($J$65,),SchemaKK2,2,0)),\"\",VLOOKUP(TEXT($B66,)&\" - \"&TEXT($J$65,),SchemaKK2,2,0)),\"\")","v":""},{"$f":"IFERROR(IF(ISBLANK(VLOOKUP(TEXT($B66,)&\" - \"&TEXT($J$65,),SchemaKK2,3,0)),\"\",VLOOKUP(TEXT($B66,)&\" - \"&TEXT($J$65,),SchemaKK2,3,0)),\"\")","v":""},{"$f":"IF(K66=\"\",\"\",IF(J66>K66,\"w\",IF(J66=K66,\"g\",\"v\")))","v":""},{"$f":"IFERROR(IF(ISBLANK(VLOOKUP(TEXT($B66,)&\" - \"&TEXT($M$65,),SchemaKK2,2,0)),\"\",VLOOKUP(TEXT($B66,)&\" - \"&TEXT($M$65,),SchemaKK2,2,0)),\"\")","v":""},{"$f":"IFERROR(IF(ISBLANK(VLOOKUP(TEXT($B66,)&\" - \"&TEXT($M$65,),SchemaKK2,3,0)),\"\",VLOOKUP(TEXT($B66,)&\" - \"&TEXT($M$65,),SchemaKK2,3,0)),\"\")","v":""},{"$f":"IF(N66=\"\",\"\",IF(M66>N66,\"w\",IF(M66=N66,\"g\",\"v\")))","v":""},{"$f":"IFERROR(IF(ISBLANK(VLOOKUP(TEXT($B66,)&\" - \"&TEXT($P$65,),SchemaKK2,2,0)),\"\",VLOOKUP(TEXT($B66,)&\" - \"&TEXT($P$65,),SchemaKK2,2,0)),\"\")","v":""},{"$f":"IFERROR(IF(ISBLANK(VLOOKUP(TEXT($B66,)&\" - \"&TEXT($P$65,),SchemaKK2,3,0)),\"\",VLOOKUP(TEXT($B66,)&\" - \"&TEXT($P$65,),SchemaKK2,3,0)),\"\")","v":""},{"$f":"IF(Q66=\"\",\"\",IF(P66>Q66,\"w\",IF(P66=Q66,\"g\",\"v\")))","v":""},{"$f":"IFERROR(IF(ISBLANK(VLOOKUP(TEXT($B66,)&\" - \"&TEXT($S$65,),SchemaKK2,2,0)),\"\",VLOOKUP(TEXT($B66,)&\" - \"&TEXT($S$65,),SchemaKK2,2,0)),\"\")","v":""},{"$f":"IFERROR(IF(ISBLANK(VLOOKUP(TEXT($B66,)&\" - \"&TEXT($S$65,),SchemaKK2,3,0)),\"\",VLOOKUP(TEXT($B66,)&\" - \"&TEXT($S$65,),SchemaKK2,3,0)),\"\")","v":""},{"$f":"IF(T66=\"\",\"\",IF(S66>T66,\"w\",IF(S66=T66,\"g\",\"v\")))","v":""},{"$f":"IFERROR(IF(ISBLANK(VLOOKUP(TEXT($B66,)&\" - \"&TEXT($V$65,),SchemaKK2,2,0)),\"\",VLOOKUP(TEXT($B66,)&\" - \"&TEXT($V$65,),SchemaKK2,2,0)),\"\")","v":""},{"$f":"IFERROR(IF(ISBLANK(VLOOKUP(TEXT($B66,)&\" - \"&TEXT($V$65,),SchemaKK2,3,0)),\"\",VLOOKUP(TEXT($B66,)&\" - \"&TEXT($V$65,),SchemaKK2,3,0)),\"\")","v":""},{"$f":"IF(W66=\"\",\"\",IF(V66>W66,\"w\",IF(V66=W66,\"g\",\"v\")))","v":""},{"$f":"IFERROR(IF(ISBLANK(VLOOKUP(TEXT($B66,)&\" - \"&TEXT($Y$65,),SchemaKK2,2,0)),\"\",VLOOKUP(TEXT($B66,)&\" - \"&TEXT($Y$65,),SchemaKK2,2,0)),\"\")","v":""},{"$f":"IFERROR(IF(ISBLANK(VLOOKUP(TEXT($B66,)&\" - \"&TEXT($Y$65,),SchemaKK2,3,0)),\"\",VLOOKUP(TEXT($B66,)&\" - \"&TEXT($Y$65,),SchemaKK2,3,0)),\"\")","v":""},{"$f":"IF(Z66=\"\",\"\",IF(Y66>Z66,\"w\",IF(Y66=Z66,\"g\",\"v\")))","v":""},{"$f":"IFERROR(IF(ISBLANK(VLOOKUP(TEXT($B66,)&\" - \"&TEXT($AB$65,),SchemaKK2,2,0)),\"\",VLOOKUP(TEXT($B66,)&\" - \"&TEXT($AB$65,),SchemaKK2,2,0)),\"\")","v":""},{"$f":"IFERROR(IF(ISBLANK(VLOOKUP(TEXT($B66,)&\" - \"&TEXT($AB$65,),SchemaKK2,3,0)),\"\",VLOOKUP(TEXT($B66,)&\" - \"&TEXT($AB$65,),SchemaKK2,3,0)),\"\")","v":""},{"$f":"IF(AC66=\"\",\"\",IF(AB66>AC66,\"w\",IF(AB66=AC66,\"g\",\"v\")))","v":""},{"$f":"IFERROR(IF(ISBLANK(VLOOKUP(TEXT($B66,)&\" - \"&TEXT($AE$65,),SchemaKK2,2,0)),\"\",VLOOKUP(TEXT($B66,)&\" - \"&TEXT($AE$65,),SchemaKK2,2,0)),\"\")","v":""},{"$f":"IFERROR(IF(ISBLANK(VLOOKUP(TEXT($B66,)&\" - \"&TEXT($AE$65,),SchemaKK2,3,0)),\"\",VLOOKUP(TEXT($B66,)&\" - \"&TEXT($AE$65,),SchemaKK2,3,0)),\"\")","v":""},{"$f":"IF(AF66=\"\",\"\",IF(AE66>AF66,\"w\",IF(AE66=AF66,\"g\",\"v\")))","v":""},{"$f":"IFERROR(IF(ISBLANK(VLOOKUP(TEXT($B66,)&\" - \"&TEXT($AH$65,),SchemaKK2,2,0)),\"\",VLOOKUP(TEXT($B66,)&\" - \"&TEXT($AH$65,),SchemaKK2,2,0)),\"\")","v":""},{"$f":"IFERROR(IF(ISBLANK(VLOOKUP(TEXT($B66,)&\" - \"&TEXT($AH$65,),SchemaKK2,3,0)),\"\",VLOOKUP(TEXT($B66,)&\" - \"&TEXT($AH$65,),SchemaKK2,3,0)),\"\")","v":""},{"$f":"IF(AI66=\"\",\"\",IF(AH66>AI66,\"w\",IF(AH66=AI66,\"g\",\"v\")))","v":""},{"$f":"IFERROR(IF(ISBLANK(VLOOKUP(TEXT($B66,)&\" - \"&TEXT($AK$65,),SchemaKK2,2,0)),\"\",VLOOKUP(TEXT($B66,)&\" - \"&TEXT($AK$65,),SchemaKK2,2,0)),\"\")","v":""},{"$f":"IFERROR(IF(ISBLANK(VLOOKUP(TEXT($B66,)&\" - \"&TEXT($AK$65,),SchemaKK2,3,0)),\"\",VLOOKUP(TEXT($B66,)&\" - \"&TEXT($AK$65,),SchemaKK2,3,0)),\"\")","v":""},{"$f":"IF(AL66=\"\",\"\",IF(AK66>AL66,\"w\",IF(AK66=AL66,\"g\",\"v\")))","v":""},{"$f":"IFERROR(IF(ISBLANK(VLOOKUP(TEXT($B66,)&\" - \"&TEXT($AN$65,),SchemaKK2,2,0)),\"\",VLOOKUP(TEXT($B66,)&\" - \"&TEXT($AN$65,),SchemaKK2,2,0)),\"\")","v":""},{"$f":"IFERROR(IF(ISBLANK(VLOOKUP(TEXT($B66,)&\" - \"&TEXT($AN$65,),SchemaKK2,3,0)),\"\",VLOOKUP(TEXT($B66,)&\" - \"&TEXT($AN$65,),SchemaKK2,3,0)),\"\")","v":""},{"$f":"IF(AO66=\"\",\"\",IF(AN66>AO66,\"w\",IF(AN66=AO66,\"g\",\"v\")))","v":""},{"$f":"IFERROR(IF(ISBLANK(VLOOKUP(TEXT($B66,)&\" - \"&TEXT($AQ$65,),SchemaKK2,2,0)),\"\",VLOOKUP(TEXT($B66,)&\" - \"&TEXT($AQ$65,),SchemaKK2,2,0)),\"\")","v":""},{"$f":"IFERROR(IF(ISBLANK(VLOOKUP(TEXT($B66,)&\" - \"&TEXT($AQ$65,),SchemaKK2,3,0)),\"\",VLOOKUP(TEXT($B66,)&\" - \"&TEXT($AQ$65,),SchemaKK2,3,0)),\"\")","v":""},{"$f":"IF(AR66=\"\",\"\",IF(AQ66>AR66,\"w\",IF(AQ66=AR66,\"g\",\"v\")))","v":""},{"$f":"IFERROR(IF(ISBLANK(VLOOKUP(TEXT($B66,)&\" - \"&TEXT($AT$65,),SchemaKK2,2,0)),\"\",VLOOKUP(TEXT($B66,)&\" - \"&TEXT($AT$65,),SchemaKK2,2,0)),\"\")","v":""},{"$f":"IFERROR(IF(ISBLANK(VLOOKUP(TEXT($B66,)&\" - \"&TEXT($AT$65,),SchemaKK2,3,0)),\"\",VLOOKUP(TEXT($B66,)&\" - \"&TEXT($AT$65,),SchemaKK2,3,0)),\"\")","v":""},{"$f":"IF(AU66=\"\",\"\",IF(AT66>AU66,\"w\",IF(AT66=AU66,\"g\",\"v\")))","v":""},{"$f":"IFERROR(IF(ISBLANK(VLOOKUP(TEXT($B66,)&\" - \"&TEXT($AW$65,),SchemaKK2,2,0)),\"\",VLOOKUP(TEXT($B66,)&\" - \"&TEXT($AW$65,),SchemaKK2,2,0)),\"\")","v":""},{"$f":"IFERROR(IF(ISBLANK(VLOOKUP(TEXT($B66,)&\" - \"&TEXT($AW$65,),SchemaKK2,3,0)),\"\",VLOOKUP(TEXT($B66,)&\" - \"&TEXT($AW$65,),SchemaKK2,3,0)),\"\")","v":""},{"$f":"IF(AX66=\"\",\"\",IF(AW66>AX66,\"w\",IF(AW66=AX66,\"g\",\"v\")))","v":""},{"$f":"IFERROR(IF(ISBLANK(VLOOKUP(TEXT($B66,)&\" - \"&TEXT($AZ$65,),SchemaKK2,2,0)),\"\",VLOOKUP(TEXT($B66,)&\" - \"&TEXT($AZ$65,),SchemaKK2,2,0)),\"\")","v":""},{"$f":"IFERROR(IF(ISBLANK(VLOOKUP(TEXT($B66,)&\" - \"&TEXT($AZ$65,),SchemaKK2,3,0)),\"\",VLOOKUP(TEXT($B66,)&\" - \"&TEXT($AZ$65,),SchemaKK2,3,0)),\"\")","v":""},{"$f":"IF(BA66=\"\",\"\",IF(AZ66>BA66,\"w\",IF(AZ66=BA66,\"g\",\"v\")))","v":""},{"$f":"IFERROR(IF(ISBLANK(VLOOKUP(TEXT($B66,)&\" - \"&TEXT($BC$65,),SchemaKK2,2,0)),\"\",VLOOKUP(TEXT($B66,)&\" - \"&TEXT($BC$65,),SchemaKK2,2,0)),\"\")","v":""},{"$f":"IFERROR(IF(ISBLANK(VLOOKUP(TEXT($B66,)&\" - \"&TEXT($BC$65,),SchemaKK2,3,0)),\"\",VLOOKUP(TEXT($B66,)&\" - \"&TEXT($BC$65,),SchemaKK2,3,0)),\"\")","v":""},{"$f":"IF(BD66=\"\",\"\",IF(BC66>BD66,\"w\",IF(BC66=BD66,\"g\",\"v\")))","v":""},{"$f":"IFERROR(IF(ISBLANK(VLOOKUP(TEXT($B66,)&\" - \"&TEXT($BF$65,),SchemaKK2,2,0)),\"\",VLOOKUP(TEXT($B66,)&\" - \"&TEXT($BF$65,),SchemaKK2,2,0)),\"\")","v":""},{"$f":"IFERROR(IF(ISBLANK(VLOOKUP(TEXT($B66,)&\" - \"&TEXT($BF$65,),SchemaKK2,3,0)),\"\",VLOOKUP(TEXT($B66,)&\" - \"&TEXT($BF$65,),SchemaKK2,3,0)),\"\")","v":""},{"$f":"IF(BG66=\"\",\"\",IF(BF66>BG66,\"w\",IF(BF66=BG66,\"g\",\"v\")))","v":""},{"$f":"IFERROR(IF(ISBLANK(VLOOKUP(TEXT($B66,)&\" - \"&TEXT($BI$65,),SchemaKK2,2,0)),\"\",VLOOKUP(TEXT($B66,)&\" - \"&TEXT($BI$65,),SchemaKK2,2,0)),\"\")","v":""},{"$f":"IFERROR(IF(ISBLANK(VLOOKUP(TEXT($B66,)&\" - \"&TEXT($BI$65,),SchemaKK2,3,0)),\"\",VLOOKUP(TEXT($B66,)&\" - \"&TEXT($BI$65,),SchemaKK2,3,0)),\"\")","v":""},{"$f":"IF(BJ66=\"\",\"\",IF(BI66>BJ66,\"w\",IF(BI66=BJ66,\"g\",\"v\")))","v":""},{"$f":"COUNTIF(F66:BK66,\"w\")","v":0},{"$f":"COUNTIF(F66:BK66,\"g\")","v":0},{"$f":"COUNTIF(F66:BK66,\"v\")","v":0},{"$f":"SUM(D66,G66,J66,M66,P66,S66,V66,Y66,AB66,AE66,AH66,AK66,AN66,AQ66,AT66,AW66,AZ66,BC66,BF66,BI66)","v":0},{"$f":"SUM(E66,H66,K66,N66,Q66,T66,W66,Z66,AC66,AF66,AI66,AL66,AO66,AR66,AU66,AX66,BA66,BD66,BG66,BJ66)","v":0},null,{"$f":"RANK(CC66,$CC$66:$CC$85)","v":1},"Almere City FC",{"$f":"SUM(BU66:BW66)","v":0},{"$f":"INDEX($BL$66:$BL$85,MATCH(BS66,$B$66:$B$85,0))+INDEX($D$87:$BJ$87,MATCH(BS66,$D$65:$BJ$65,0))","v":0},{"$f":"INDEX($BM$66:$BM$85,MATCH(BS66,$B$66:$B$85,0))+INDEX($D$88:$BJ$88,MATCH(BS66,$D$65:$BJ$65,0))","v":0},{"$f":"INDEX($BN$66:$BN$85,MATCH(BS66,$B$66:$B$85,0))+INDEX($D$89:$BJ$89,MATCH(BS66,$D$65:$BJ$65,0))","v":0},null,{"$f":"(BU66*3)+BV66+BX66","v":0},{"$f":"CA66-CB66","v":0},{"$f":"INDEX($BO$66:$BO$85,MATCH(BS66,$B$66:$B$85,0))+INDEX($D$90:$BJ$90,MATCH(BS66,$D$65:$BJ$65,0))","v":0},{"$f":"INDEX($BP$66:$BP$85,MATCH(BS66,$B$66:$B$85,0))+INDEX($D$91:$BJ$91,MATCH(BS66,$D$65:$BJ$65,0))","v":0},{"$f":"VALUE(TEXT(BY66,\"000\")&TEXT(100+BZ66,\"000\")&TEXT(CA66,\"000\")&TEXT(100-BT66,\"00\")&TEXT(COUNTIF($BS$66:$BS$85,\">=\"&BS66),\"00\"))","v":10000010020}]
[null,{"$f":"BS67","v":"FC Den Bosch"},null,{"$f":"IFERROR(IF(ISBLANK(VLOOKUP(TEXT($B67,)&\" - \"&TEXT($D$65,),SchemaKK2,2,0)),\"\",VLOOKUP(TEXT($B67,)&\" - \"&TEXT($D$65,),SchemaKK2,2,0)),\"\")","v":""},{"$f":"IFERROR(IF(ISBLANK(VLOOKUP(TEXT($B67,)&\" - \"&TEXT($D$65,),SchemaKK2,3,0)),\"\",VLOOKUP(TEXT($B67,)&\" - \"&TEXT($D$65,),SchemaKK2,3,0)),\"\")","v":""},{"$f":"IF(E67=\"\",\"\",IF(D67>E67,\"w\",IF(D67=E67,\"g\",\"v\")))","v":""},null,null,null,{"$f":"IFERROR(IF(ISBLANK(VLOOKUP(TEXT($B67,)&\" - \"&TEXT($J$65,),SchemaKK2,2,0)),\"\",VLOOKUP(TEXT($B67,)&\" - \"&TEXT($J$65,),SchemaKK2,2,0)),\"\")","v":""},{"$f":"IFERROR(IF(ISBLANK(VLOOKUP(TEXT($B67,)&\" - \"&TEXT($J$65,),SchemaKK2,3,0)),\"\",VLOOKUP(TEXT($B67,)&\" - \"&TEXT($J$65,),SchemaKK2,3,0)),\"\")","v":""},"",{"$f":"IFERROR(IF(ISBLANK(VLOOKUP(TEXT($B67,)&\" - \"&TEXT($M$65,),SchemaKK2,2,0)),\"\",VLOOKUP(TEXT($B67,)&\" - \"&TEXT($M$65,),SchemaKK2,2,0)),\"\")","v":""},{"$f":"IFERROR(IF(ISBLANK(VLOOKUP(TEXT($B67,)&\" - \"&TEXT($M$65,),SchemaKK2,3,0)),\"\",VLOOKUP(TEXT($B67,)&\" - \"&TEXT($M$65,),SchemaKK2,3,0)),\"\")","v":""},"",{"$f":"IFERROR(IF(ISBLANK(VLOOKUP(TEXT($B67,)&\" - \"&TEXT($P$65,),SchemaKK2,2,0)),\"\",VLOOKUP(TEXT($B67,)&\" - \"&TEXT($P$65,),SchemaKK2,2,0)),\"\")","v":""},{"$f":"IFERROR(IF(ISBLANK(VLOOKUP(TEXT($B67,)&\" - \"&TEXT($P$65,),SchemaKK2,3,0)),\"\",VLOOKUP(TEXT($B67,)&\" - \"&TEXT($P$65,),SchemaKK2,3,0)),\"\")","v":""},"",{"$f":"IFERROR(IF(ISBLANK(VLOOKUP(TEXT($B67,)&\" - \"&TEXT($S$65,),SchemaKK2,2,0)),\"\",VLOOKUP(TEXT($B67,)&\" - \"&TEXT($S$65,),SchemaKK2,2,0)),\"\")","v":""},{"$f":"IFERROR(IF(ISBLANK(VLOOKUP(TEXT($B67,)&\" - \"&TEXT($S$65,),SchemaKK2,3,0)),\"\",VLOOKUP(TEXT($B67,)&\" - \"&TEXT($S$65,),SchemaKK2,3,0)),\"\")","v":""},"","","","","","","","","","","","","","","","","","","","","","","","","","","","","","","","","","","","","","","","","","","",0,0,0,0,0,null,2,"FC Den Bosch",0,0,0,0,null,0,0,0,0,10000010019]
[null,"FC Dordrecht",null,"","","",{"$f":"IFERROR(IF(ISBLANK(VLOOKUP(TEXT($B68,)&\" - \"&TEXT($G$65,),SchemaKK2,2,0)),\"\",VLOOKUP(TEXT($B68,)&\" - \"&TEXT($G$65,),SchemaKK2,2,0)),\"\")","v":""},{"$f":"IFERROR(IF(ISBLANK(VLOOKUP(TEXT($B68,)&\" - \"&TEXT($G$65,),SchemaKK2,3,0)),\"\",VLOOKUP(TEXT($B68,)&\" - \"&TEXT($G$65,),SchemaKK2,3,0)),\"\")","v":""},"",null,null,null,{"$f":"IFERROR(IF(ISBLANK(VLOOKUP(TEXT($B68,)&\" - \"&TEXT($M$65,),SchemaKK2,2,0)),\"\",VLOOKUP(TEXT($B68,)&\" - \"&TEXT($M$65,),SchemaKK2,2,0)),\"\")","v":""},{"$f":"IFERROR(IF(ISBLANK(VLOOKUP(TEXT($B68,)&\" - \"&TEXT($M$65,),SchemaKK2,3,0)),\"\",VLOOKUP(TEXT($B68,)&\" - \"&TEXT($M$65,),SchemaKK2,3,0)),\"\")","v":""},"",{"$f":"IFERROR(IF(ISBLANK(VLOOKUP(TEXT($B68,)&\" - \"&TEXT($P$65,),SchemaKK2,2,0)),\"\",VLOOKUP(TEXT($B68,)&\" - \"&TEXT($P$65,),SchemaKK2,2,0)),\"\")","v":""},{"$f":"IFERROR(IF(ISBLANK(VLOOKUP(TEXT($B68,)&\" - \"&TEXT($P$65,),SchemaKK2,3,0)),\"\",VLOOKUP(TEXT($B68,)&\" - \"&TEXT($P$65,),SchemaKK2,3,0)),\"\")","v":""},"",{"$f":"IFERROR(IF(ISBLANK(VLOOKUP(TEXT($B68,)&\" - \"&TEXT($S$65,),SchemaKK2,2,0)),\"\",VLOOKUP(TEXT($B68,)&\" - \"&TEXT($S$65,),SchemaKK2,2,0)),\"\")","v":""},{"$f":"IFERROR(IF(ISBLANK(VLOOKUP(TEXT($B68,)&\" - \"&TEXT($S$65,),SchemaKK2,3,0)),\"\",VLOOKUP(TEXT($B68,)&\" - \"&TEXT($S$65,),SchemaKK2,3,0)),\"\")","v":""},"","","","","","","","","","","","","","","","","","","","","","","","","","","","","","","","","","","","","","","","","","","",0,0,0,0,0,null,3,"FC Dordrecht",0,0,0,0,null,0,0,0,0,10000010018]
[null,"FC Eindhoven",null,"","","","","","",{"$f":"IFERROR(IF(ISBLANK(VLOOKUP(TEXT($B69,)&\" - \"&TEXT($J$65,),SchemaKK2,2,0)),\"\",VLOOKUP(TEXT($B69,)&\" - \"&TEXT($J$65,),SchemaKK2,2,0)),\"\")","v":""},{"$f":"IFERROR(IF(ISBLANK(VLOOKUP(TEXT($B69,)&\" - \"&TEXT($J$65,),SchemaKK2,3,0)),\"\",VLOOKUP(TEXT($B69,)&\" - \"&TEXT($J$65,),SchemaKK2,3,0)),\"\")","v":""},"",null,null,null,{"$f":"IFERROR(IF(ISBLANK(VLOOKUP(TEXT($B69,)&\" - \"&TEXT($P$65,),SchemaKK2,2,0)),\"\",VLOOKUP(TEXT($B69,)&\" - \"&TEXT($P$65,),SchemaKK2,2,0)),\"\")","v":""},{"$f":"IFERROR(IF(ISBLANK(VLOOKUP(TEXT($B69,)&\" - \"&TEXT($P$65,),SchemaKK2,3,0)),\"\",VLOOKUP(TEXT($B69,)&\" - \"&TEXT($P$65,),SchemaKK2,3,0)),\"\")","v":""},"",{"$f":"IFERROR(IF(ISBLANK(VLOOKUP(TEXT($B69,)&\" - \"&TEXT($S$65,),SchemaKK2,2,0)),\"\",VLOOKUP(TEXT($B69,)&\" - \"&TEXT($S$65,),SchemaKK2,2,0)),\"\")","v":""},{"$f":"IFERROR(IF(ISBLANK(VLOOKUP(TEXT($B69,)&\" - \"&TEXT($S$65,),SchemaKK2,3,0)),\"\",VLOOKUP(TEXT($B69,)&\" - \"&TEXT($S$65,),SchemaKK2,3,0)),\"\")","v":""},"","","","","","","","","","","","","","","","","","","","","","","","","","","","","","","","","","","","","","","","","","","",0,0,0,0,0,null,4,"FC Eindhoven",0,0,0,0,null,0,0,0,0,10000010017]
[null,"FC Twente",null,"","","","","","","","","",{"$f":"IFERROR(IF(ISBLANK(VLOOKUP(TEXT($B70,)&\" - \"&TEXT($M$65,),SchemaKK2,2,0)),\"\",VLOOKUP(TEXT($B70,)&\" - \"&TEXT($M$65,),SchemaKK2,2,0)),\"\")","v":""},{"$f":"IFERROR(IF(ISBLANK(VLOOKUP(TEXT($B70,)&\" - \"&TEXT($M$65,),SchemaKK2,3,0)),\"\",VLOOKUP(TEXT($B70,)&\" - \"&TEXT($M$65,),SchemaKK2,3,0)),\"\")","v":""},"",null,null,null,{"$f":"IFERROR(IF(ISBLANK(VLOOKUP(TEXT($B70,)&\" - \"&TEXT($S$65,),SchemaKK2,2,0)),\"\",VLOOKUP(TEXT($B70,)&\" - \"&TEXT($S$65,),SchemaKK2,2,0)),\"\")","v":""},{"$f":"IFERROR(IF(ISBLANK(VLOOKUP(TEXT($B70,)&\" - \"&TEXT($S$65,),SchemaKK2,3,0)),\"\",VLOOKUP(TEXT($B70,)&\" - \"&TEXT($S$65,),SchemaKK2,3,0)),\"\")","v":""},"","","","","","","","","","","","","","","","","","","","","","","","","","","","","","","","","","","","","","","","","","","",0,0,0,0,0,null,5,"FC Twente",0,0,0,0,null,0,0,0,0,10000010016]
[null,"FC Volendam",null,"","","","","","","","","","","","",{"$f":"IFERROR(IF(ISBLANK(VLOOKUP(TEXT($B71,)&\" - \"&TEXT($P$65,),SchemaKK2,2,0)),\"\",VLOOKUP(TEXT($B71,)&\" - \"&TEXT($P$65,),SchemaKK2,2,0)),\"\")","v":""},{"$f":"IFERROR(IF(ISBLANK(VLOOKUP(TEXT($B71,)&\" - \"&TEXT($P$65,),SchemaKK2,3,0)),\"\",VLOOKUP(TEXT($B71,)&\" - \"&TEXT($P$65,),SchemaKK2,3,0)),\"\")","v":""},"",null,null,null,"","","","","","","","","","","","","","","","","","","","","","","","","","","","","","","","","","","","","","","","","","",0,0,0,0,0,null,6,"FC Volendam",0,0,0,0,null,0,0,0,0,10000010015]
[null,"Go Ahead Eagles",null,"","","","","","","","","","","","","","","",{"$f":"IFERROR(IF(ISBLANK(VLOOKUP(TEXT($B72,)&\" - \"&TEXT($S$65,),SchemaKK2,2,0)),\"\",VLOOKUP(TEXT($B72,)&\" - \"&TEXT($S$65,),SchemaKK2,2,0)),\"\")","v":""},{"$f":"IFERROR(IF(ISBLANK(VLOOKUP(TEXT($B72,)&\" - \"&TEXT($S$65,),SchemaKK2,3,0)),\"\",VLOOKUP(TEXT($B72,)&\" - \"&TEXT($S$65,),SchemaKK2,3,0)),\"\")","v":""},"",null,null,null,"","","","","","","","","","","","","","","","","","","","","","","","","","","","","","","","","","","","","","","",0,0,0,0,0,null,7,"Go Ahead Eagles",0,0,0,0,null,0,0,0,0,10000010014]
[null,"Helmond Sport",null,"","","","","","","","","","","","","","","","","","",{"$f":"IFERROR(IF(ISBLANK(VLOOKUP(TEXT($B73,)&\" - \"&TEXT($V$65,),SchemaKK2,2,0)),\"\",VLOOKUP(TEXT($B73,)&\" - \"&TEXT($V$65,),SchemaKK2,2,0)),\"\")","v":""},{"$f":"IFERROR(IF(ISBLANK(VLOOKUP(TEXT($B73,)&\" - \"&TEXT($V$65,),SchemaKK2,3,0)),\"\",VLOOKUP(TEXT($B73,)&\" - \"&TEXT($V$65,),SchemaKK2,3,0)),\"\")","v":""},"",null,null,null,"","","","","","","","","","","","","","","","","","","","","","","","","","","","","","","","","","","","",0,0,0,0,0,null,8,"Helmond Sport",0,0,0,0,null,0,0,0,0,10000010013]
[null,"Jong Ajax",null,"","","","","","","","","","","","","","","","","","","","","",{"$f":"IFERROR(IF(ISBLANK(VLOOKUP(TEXT($B74,)&\" - \"&TEXT($Y$65,),SchemaKK2,2,0)),\"\",VLOOKUP(TEXT($B74,)&\" - \"&TEXT($Y$65,),SchemaKK2,2,0)),\"\")","v":""},{"$f":"IFERROR(IF(ISBLANK(VLOOKUP(TEXT($B74,)&\" - \"&TEXT($Y$65,),SchemaKK2,3,0)),\"\",VLOOKUP(TEXT($B74,)&\" - \"&TEXT($Y$65,),SchemaKK2,3,0)),\"\")","v":""},"",null,null,null,"","","","","","","","","","","","","","","","","","","","","","","","","","","","","","","","","",0,0,0,0,0,null,9,"Jong Ajax",0,0,0,0,null,0,0,0,0,10000010012]
[null,"Jong AZ Alkmaar",null,"","","","","","","","","","","","","","","","","","","","","","","","",{"$f":"IFERROR(IF(ISBLANK(VLOOKUP(TEXT($B75,)&\" - \"&TEXT($AB$65,),SchemaKK2,2,0)),\"\",VLOOKUP(TEXT($B75,)&\" - \"&TEXT($AB$65,),SchemaKK2,2,0)),\"\")","v":""},{"$f":"IFERROR(IF(ISBLANK(VLOOKUP(TEXT($B75,)&\" - \"&TEXT($AB$65,),SchemaKK2,3,0)),\"\",VLOOKUP(TEXT($B75,)&\" - \"&TEXT($AB$65,),SchemaKK2,3,0)),\"\")","v":""},"",null,null,null,"","","","","","","","","","","","","","","","","","","","","","","","","","","","","","",0,0,0,0,0,null,10,"Jong AZ Alkmaar",0,0,0,0,null,0,0,0,0,10000010011]
[null,"Jong FC Utrecht",null,"","","","","","","","","","","","","","","","","","","","","","","","","","","",{"$f":"IFERROR(IF(ISBLANK(VLOOKUP(TEXT($B76,)&\" - \"&TEXT($AE$65,),SchemaKK2,2,0)),\"\",VLOOKUP(TEXT($B76,)&\" - \"&TEXT($AE$65,),SchemaKK2,2,0)),\"\")","v":""},{"$f":"IFERROR(IF(ISBLANK(VLOOKUP(TEXT($B76,)&\" - \"&TEXT($AE$65,),SchemaKK2,3,0)),\"\",VLOOKUP(TEXT($B76,)&\" - \"&TEXT($AE$65,),SchemaKK2,3,0)),\"\")","v":""},"",null,null,null,"","","","","","","","","","","","","","","","","","","","","","","","","","","",0,0,0,0,0,null,11,"Jong FC Utrecht",0,0,0,0,null,0,0,0,0,10000010010]
[null,"Jong PSV",null,"","","","","","","","","","","","","","","","","","","","","","","","","","","","","","",{"$f":"IFERROR(IF(ISBLANK(VLOOKUP(TEXT($B77,)&\" - \"&TEXT($AH$65,),SchemaKK2,2,0)),\"\",VLOOKUP(TEXT($B77,)&\" - \"&TEXT($AH$65,),SchemaKK2,2,0)),\"\")","v":""},{"$f":"IFERROR(IF(ISBLANK(VLOOKUP(TEXT($B77,)&\" - \"&TEXT($AH$65,),SchemaKK2,3,0)),\"\",VLOOKUP(TEXT($B77,)&\" - \"&TEXT($AH$65,),SchemaKK2,3,0)),\"\")","v":""},"",null,null,null,"","","","","","","","","","","","","","","","","","","","","","","","",0,0,0,0,0,null,12,"Jong PSV",0,0,0,0,null,0,0,0,0,10000010009]
[null,"MVV Maastricht",null,"","","","","","","","","","","","","","","","","","","","","","","","","","","","","","","","","",{"$f":"IFERROR(IF(ISBLANK(VLOOKUP(TEXT($B78,)&\" - \"&TEXT($AK$65,),SchemaKK2,2,0)),\"\",VLOOKUP(TEXT($B78,)&\" - \"&TEXT($AK$65,),SchemaKK2,2,0)),\"\")","v":""},{"$f":"IFERROR(IF(ISBLANK(VLOOKUP(TEXT($B78,)&\" - \"&TEXT($AK$65,),SchemaKK2,3,0)),\"\",VLOOKUP(TEXT($B78,)&\" - \"&TEXT($AK$65,),SchemaKK2,3,0)),\"\")","v":""},"",null,null,null,"","","","","","","","","","","","","","","","","","","","","",0,0,0,0,0,null,13,"MVV Maastricht",0,0,0,0,null,0,0,0,0,10000010008]
[null,"NEC Nijmegen",null,"","","","","","","","","","","","","","","","","","","","","","","","","","","","","","","","","","","","",{"$f":"IFERROR(IF(ISBLANK(VLOOKUP(TEXT($B79,)&\" - \"&TEXT($AN$65,),SchemaKK2,2,0)),\"\",VLOOKUP(TEXT($B79,)&\" - \"&TEXT($AN$65,),SchemaKK2,2,0)),\"\")","v":""},{"$f":"IFERROR(IF(ISBLANK(VLOOKUP(TEXT($B79,)&\" - \"&TEXT($AN$65,),SchemaKK2,3,0)),\"\",VLOOKUP(TEXT($B79,)&\" - \"&TEXT($AN$65,),SchemaKK2,3,0)),\"\")","v":""},"",null,null,null,"","","","","","","","","","","","","","","","","","",0,0,0,0,0,null,14,"NEC Nijmegen",0,0,0,0,null,0,0,0,0,10000010007]
[null,"RKC Waalwijk",null,"","","","","","","","","","","","","","","","","","","","","","","","","","","","","","","","","","","","","","","",{"$f":"IFERROR(IF(ISBLANK(VLOOKUP(TEXT($B80,)&\" - \"&TEXT($AQ$65,),SchemaKK2,2,0)),\"\",VLOOKUP(TEXT($B80,)&\" - \"&TEXT($AQ$65,),SchemaKK2,2,0)),\"\")","v":""},{"$f":"IFERROR(IF(ISBLANK(VLOOKUP(TEXT($B80,)&\" - \"&TEXT($AQ$65,),SchemaKK2,3,0)),\"\",VLOOKUP(TEXT($B80,)&\" - \"&TEXT($AQ$65,),SchemaKK2,3,0)),\"\")","v":""},"",null,null,null,"","","","","","","","","","","","","","","",0,0,0,0,0,null,15,"RKC Waalwijk",0,0,0,0,null,0,0,0,0,10000010006]
[null,"Roda JC Kerkrade",null,"","","","","","","","","","","","","","","","","","","","","","","","","","","","","","","","","","","","","","","","","","",{"$f":"IFERROR(IF(ISBLANK(VLOOKUP(TEXT($B81,)&\" - \"&TEXT($AT$65,),SchemaKK2,2,0)),\"\",VLOOKUP(TEXT($B81,)&\" - \"&TEXT($AT$65,),SchemaKK2,2,0)),\"\")","v":""},{"$f":"IFERROR(IF(ISBLANK(VLOOKUP(TEXT($B81,)&\" - \"&TEXT($AT$65,),SchemaKK2,3,0)),\"\",VLOOKUP(TEXT($B81,)&\" - \"&TEXT($AT$65,),SchemaKK2,3,0)),\"\")","v":""},"",null,null,null,"","","","","","","","","","","","",0,0,0,0,0,null,16,"Roda JC Kerkrade",0,0,0,0,null,0,0,0,0,10000010005]
[null,"SC Cambuur",null,"","","","","","","","","","","","","","","","","","","","","","","","","","","","","","","","","","","","","","","","","","",{"$f":"IFERROR(IF(ISBLANK(VLOOKUP(TEXT($B82,)&\" - \"&TEXT($AT$65,),SchemaKK2,2,0)),\"\",VLOOKUP(TEXT($B82,)&\" - \"&TEXT($AT$65,),SchemaKK2,2,0)),\"\")","v":""},{"$f":"IFERROR(IF(ISBLANK(VLOOKUP(TEXT($B82,)&\" - \"&TEXT($AT$65,),SchemaKK2,3,0)),\"\",VLOOKUP(TEXT($B82,)&\" - \"&TEXT($AT$65,),SchemaKK2,3,0)),\"\")","v":""},"",{"$f":"IFERROR(IF(ISBLANK(VLOOKUP(TEXT($B82,)&\" - \"&TEXT($AW$65,),SchemaKK2,2,0)),\"\",VLOOKUP(TEXT($B82,)&\" - \"&TEXT($AW$65,),SchemaKK2,2,0)),\"\")","v":""},{"$f":"IFERROR(IF(ISBLANK(VLOOKUP(TEXT($B82,)&\" - \"&TEXT($AW$65,),SchemaKK2,3,0)),\"\",VLOOKUP(TEXT($B82,)&\" - \"&TEXT($AW$65,),SchemaKK2,3,0)),\"\")","v":""},"",null,null,null,"","","","","","","","","",0,0,0,0,0,null,17,"SC Cambuur",0,0,0,0,null,0,0,0,0,10000010004]
[null,"SC Telstar",null,"","","","","","","","","","","","","","","","","","","","","","","","","","","","","","","","","","","","","","","","","","",{"$f":"IFERROR(IF(ISBLANK(VLOOKUP(TEXT($B83,)&\" - \"&TEXT($AT$65,),SchemaKK2,2,0)),\"\",VLOOKUP(TEXT($B83,)&\" - \"&TEXT($AT$65,),SchemaKK2,2,0)),\"\")","v":""},{"$f":"IFERROR(IF(ISBLANK(VLOOKUP(TEXT($B83,)&\" - \"&TEXT($AT$65,),SchemaKK2,3,0)),\"\",VLOOKUP(TEXT($B83,)&\" - \"&TEXT($AT$65,),SchemaKK2,3,0)),\"\")","v":""},"",{"$f":"IFERROR(IF(ISBLANK(VLOOKUP(TEXT($B83,)&\" - \"&TEXT($AW$65,),SchemaKK2,2,0)),\"\",VLOOKUP(TEXT($B83,)&\" - \"&TEXT($AW$65,),SchemaKK2,2,0)),\"\")","v":""},{"$f":"IFERROR(IF(ISBLANK(VLOOKUP(TEXT($B83,)&\" - \"&TEXT($AW$65,),SchemaKK2,3,0)),\"\",VLOOKUP(TEXT($B83,)&\" - \"&TEXT($AW$65,),SchemaKK2,3,0)),\"\")","v":""},"",{"$f":"IFERROR(IF(ISBLANK(VLOOKUP(TEXT($B83,)&\" - \"&TEXT($AZ$65,),SchemaKK2,2,0)),\"\",VLOOKUP(TEXT($B83,)&\" - \"&TEXT($AZ$65,),SchemaKK2,2,0)),\"\")","v":""},{"$f":"IFERROR(IF(ISBLANK(VLOOKUP(TEXT($B83,)&\" - \"&TEXT($AZ$65,),SchemaKK2,3,0)),\"\",VLOOKUP(TEXT($B83,)&\" - \"&TEXT($AZ$65,),SchemaKK2,3,0)),\"\")","v":""},"",null,null,null,"","","","","","",0,0,0,0,0,null,18,"SC Telstar",0,0,0,0,null,0,0,0,0,10000010003]
[null,"Sparta Rotterdam",null,"","","","","","","","","","","","","","","","","","","","","","","","","","","","","","","","","","","","","","","","","","",{"$f":"IFERROR(IF(ISBLANK(VLOOKUP(TEXT($B84,)&\" - \"&TEXT($AT$65,),SchemaKK2,2,0)),\"\",VLOOKUP(TEXT($B84,)&\" - \"&TEXT($AT$65,),SchemaKK2,2,0)),\"\")","v":""},{"$f":"IFERROR(IF(ISBLANK(VLOOKUP(TEXT($B84,)&\" - \"&TEXT($AT$65,),SchemaKK2,3,0)),\"\",VLOOKUP(TEXT($B84,)&\" - \"&TEXT($AT$65,),SchemaKK2,3,0)),\"\")","v":""},"",{"$f":"IFERROR(IF(ISBLANK(VLOOKUP(TEXT($B84,)&\" - \"&TEXT($AW$65,),SchemaKK2,2,0)),\"\",VLOOKUP(TEXT($B84,)&\" - \"&TEXT($AW$65,),SchemaKK2,2,0)),\"\")","v":""},{"$f":"IFERROR(IF(ISBLANK(VLOOKUP(TEXT($B84,)&\" - \"&TEXT($AW$65,),SchemaKK2,3,0)),\"\",VLOOKUP(TEXT($B84,)&\" - \"&TEXT($AW$65,),SchemaKK2,3,0)),\"\")","v":""},"",{"$f":"IFERROR(IF(ISBLANK(VLOOKUP(TEXT($B84,)&\" - \"&TEXT($AZ$65,),SchemaKK2,2,0)),\"\",VLOOKUP(TEXT($B84,)&\" - \"&TEXT($AZ$65,),SchemaKK2,2,0)),\"\")","v":""},{"$f":"IFERROR(IF(ISBLANK(VLOOKUP(TEXT($B84,)&\" - \"&TEXT($AZ$65,),SchemaKK2,3,0)),\"\",VLOOKUP(TEXT($B84,)&\" - \"&TEXT($AZ$65,),SchemaKK2,3,0)),\"\")","v":""},"",{"$f":"IFERROR(IF(ISBLANK(VLOOKUP(TEXT($B84,)&\" - \"&TEXT($BC$65,),SchemaKK2,2,0)),\"\",VLOOKUP(TEXT($B84,)&\" - \"&TEXT($BC$65,),SchemaKK2,2,0)),\"\")","v":""},{"$f":"IFERROR(IF(ISBLANK(VLOOKUP(TEXT($B84,)&\" - \"&TEXT($BC$65,),SchemaKK2,3,0)),\"\",VLOOKUP(TEXT($B84,)&\" - \"&TEXT($BC$65,),SchemaKK2,3,0)),\"\")","v":""},"",null,null,null,"","","",0,0,0,0,0,null,19,"Sparta Rotterdam",0,0,0,0,null,0,0,0,0,10000010002]
[null,"TOP Oss",null,"","","","","","","","","","","","","","","","","","","","","","","","","","","","","","","","","","","","","","","","","","",{"$f":"IFERROR(IF(ISBLANK(VLOOKUP(TEXT($B85,)&\" - \"&TEXT($AT$65,),SchemaKK2,2,0)),\"\",VLOOKUP(TEXT($B85,)&\" - \"&TEXT($AT$65,),SchemaKK2,2,0)),\"\")","v":""},{"$f":"IFERROR(IF(ISBLANK(VLOOKUP(TEXT($B85,)&\" - \"&TEXT($AT$65,),SchemaKK2,3,0)),\"\",VLOOKUP(TEXT($B85,)&\" - \"&TEXT($AT$65,),SchemaKK2,3,0)),\"\")","v":""},"",{"$f":"IFERROR(IF(ISBLANK(VLOOKUP(TEXT($B85,)&\" - \"&TEXT($AW$65,),SchemaKK2,2,0)),\"\",VLOOKUP(TEXT($B85,)&\" - \"&TEXT($AW$65,),SchemaKK2,2,0)),\"\")","v":""},{"$f":"IFERROR(IF(ISBLANK(VLOOKUP(TEXT($B85,)&\" - \"&TEXT($AW$65,),SchemaKK2,3,0)),\"\",VLOOKUP(TEXT($B85,)&\" - \"&TEXT($AW$65,),SchemaKK2,3,0)),\"\")","v":""},"",{"$f":"IFERROR(IF(ISBLANK(VLOOKUP(TEXT($B85,)&\" - \"&TEXT($AZ$65,),SchemaKK2,2,0)),\"\",VLOOKUP(TEXT($B85,)&\" - \"&TEXT($AZ$65,),SchemaKK2,2,0)),\"\")","v":""},{"$f":"IFERROR(IF(ISBLANK(VLOOKUP(TEXT($B85,)&\" - \"&TEXT($AZ$65,),SchemaKK2,3,0)),\"\",VLOOKUP(TEXT($B85,)&\" - \"&TEXT($AZ$65,),SchemaKK2,3,0)),\"\")","v":""},"",{"$f":"IFERROR(IF(ISBLANK(VLOOKUP(TEXT($B85,)&\" - \"&TEXT($BC$65,),SchemaKK2,2,0)),\"\",VLOOKUP(TEXT($B85,)&\" - \"&TEXT($BC$65,),SchemaKK2,2,0)),\"\")","v":""},{"$f":"IFERROR(IF(ISBLANK(VLOOKUP(TEXT($B85,)&\" - \"&TEXT($BC$65,),SchemaKK2,3,0)),\"\",VLOOKUP(TEXT($B85,)&\" - \"&TEXT($BC$65,),SchemaKK2,3,0)),\"\")","v":""},"",{"$f":"IFERROR(IF(ISBLANK(VLOOKUP(TEXT($B85,)&\" - \"&TEXT($BF$65,),SchemaKK2,2,0)),\"\",VLOOKUP(TEXT($B85,)&\" - \"&TEXT($BF$65,),SchemaKK2,2,0)),\"\")","v":""},{"$f":"IFERROR(IF(ISBLANK(VLOOKUP(TEXT($B85,)&\" - \"&TEXT($BF$65,),SchemaKK2,3,0)),\"\",VLOOKUP(TEXT($B85,)&\" - \"&TEXT($BF$65,),SchemaKK2,3,0)),\"\")","v":""},"",null,null,null,0,0,0,0,0,null,20,"TOP Oss",0,0,0,0,null,0,0,0,0,10000010001]
[]
[null,"Winst uit",null,{"$f":"COUNTIF(F$66:F$85,\"v\")","v":0},null,null,{"$f":"COUNTIF(I$66:I$85,\"v\")","v":0},null,null,{"$f":"COUNTIF(L$66:L$85,\"v\")","v":0},null,null,{"$f":"COUNTIF(O$66:O$85,\"v\")","v":0},null,null,{"$f":"COUNTIF(R$66:R$85,\"v\")","v":0},null,null,{"$f":"COUNTIF(U$66:U$85,\"v\")","v":0},null,null,{"$f":"COUNTIF(X$66:X$85,\"v\")","v":0},null,null,{"$f":"COUNTIF(AA$66:AA$85,\"v\")","v":0},null,null,{"$f":"COUNTIF(AD$66:AD$85,\"v\")","v":0},null,null,{"$f":"COUNTIF(AG$66:AG$85,\"v\")","v":0},null,null,{"$f":"COUNTIF(AJ$66:AJ$85,\"v\")","v":0},null,null,{"$f":"COUNTIF(AM$66:AM$85,\"v\")","v":0},null,null,{"$f":"COUNTIF(AP$66:AP$85,\"v\")","v":0},null,null,{"$f":"COUNTIF(AS$66:AS$85,\"v\")","v":0},null,null,{"$f":"COUNTIF(AV$66:AV$85,\"v\")","v":0},null,null,{"$f":"COUNTIF(AY$66:AY$85,\"v\")","v":0},null,null,{"$f":"COUNTIF(BB$66:BB$85,\"v\")","v":0},null,null,{"$f":"COUNTIF(BE$66:BE$85,\"v\")","v":0},null,null,{"$f":"COUNTIF(BH$66:BH$85,\"v\")","v":0},null,null,{"$f":"COUNTIF(BK$66:BK$85,\"v\")","v":0},null,null,null,null,null,null,null,null,null,"Periodekampioen of vervanger"]
[null,"Gelijk uit",null,{"$f":"COUNTIF(F$66:F$85,\"g\")","v":0},null,null,{"$f":"COUNTIF(I$66:I$85,\"g\")","v":0},null,null,{"$f":"COUNTIF(L$66:L$85,\"g\")","v":0},null,null,{"$f":"COUNTIF(O$66:O$85,\"g\")","v":0},null,null,{"$f":"COUNTIF(R$66:R$85,\"g\")","v":0},null,null,{"$f":"COUNTIF(U$66:U$85,\"g\")","v":0},null,null,{"$f":"COUNTIF(X$66:X$85,\"g\")","v":0},null,null,{"$f":"COUNTIF(AA$66:AA$85,\"g\")","v":0},null,null,{"$f":"COUNTIF(AD$66:AD$85,\"g\")","v":0},null,null,{"$f":"COUNTIF(AG$66:AG$85,\"g\")","v":0},null,null,{"$f":"COUNTIF(AJ$66:AJ$85,\"g\")","v":0},null,null,{"$f":"COUNTIF(AM$66:AM$85,\"g\")","v":0},null,null,{"$f":"COUNTIF(AP$66:AP$85,\"g\")","v":0},null,null,{"$f":"COUNTIF(AS$66:AS$85,\"g\")","v":0},null,null,{"$f":"COUNTIF(AV$66:AV$85,\"g\")","v":0},null,null,{"$f":"COUNTIF(AY$66:AY$85,\"g\")","v":0},null,null,{"$f":"COUNTIF(BB$66:BB$85,\"g\")","v":0},null,null,{"$f":"COUNTIF(BE$66:BE$85,\"g\")","v":0},null,null,{"$f":"COUNTIF(BH$66:BH$85,\"g\")","v":0},null,null,{"$f":"COUNTIF(BK$66:BK$85,\"g\")","v":0}]
[null,"Verlies uit",null,{"$f":"COUNTIF(F$66:F$85,\"w\")","v":0},null,null,{"$f":"COUNTIF(I$66:I$85,\"w\")","v":0},null,null,{"$f":"COUNTIF(L$66:L$85,\"w\")","v":0},null,null,{"$f":"COUNTIF(O$66:O$85,\"w\")","v":0},null,null,{"$f":"COUNTIF(R$66:R$85,\"w\")","v":0},null,null,{"$f":"COUNTIF(U$66:U$85,\"w\")","v":0},null,null,{"$f":"COUNTIF(X$66:X$85,\"w\")","v":0},null,null,{"$f":"COUNTIF(AA$66:AA$85,\"w\")","v":0},null,null,{"$f":"COUNTIF(AD$66:AD$85,\"w\")","v":0},null,null,{"$f":"COUNTIF(AG$66:AG$85,\"w\")","v":0},null,null,{"$f":"COUNTIF(AJ$66:AJ$85,\"w\")","v":0},null,null,{"$f":"COUNTIF(AM$66:AM$85,\"w\")","v":0},null,null,{"$f":"COUNTIF(AP$66:AP$85,\"w\")","v":0},null,null,{"$f":"COUNTIF(AS$66:AS$85,\"w\")","v":0},null,null,{"$f":"COUNTIF(AV$66:AV$85,\"w\")","v":0},null,null,{"$f":"COUNTIF(AY$66:AY$85,\"w\")","v":0},null,null,{"$f":"COUNTIF(BB$66:BB$85,\"w\")","v":0},null,null,{"$f":"COUNTIF(BE$66:BE$85,\"w\")","v":0},null,null,{"$f":"COUNTIF(BH$66:BH$85,\"w\")","v":0},null,null,{"$f":"COUNTIF(BK$66:BK$85,\"w\")","v":0}]
[null,"Vóór uit",null,{"$f":"SUM(E66:E85)","v":0},null,null,{"$f":"SUM(H66:H85)","v":0},null,null,{"$f":"SUM(K66:K85)","v":0},null,null,{"$f":"SUM(N66:N85)","v":0},null,null,{"$f":"SUM(Q66:Q85)","v":0},null,null,{"$f":"SUM(T66:T85)","v":0},null,null,{"$f":"SUM(W66:W85)","v":0},null,null,{"$f":"SUM(Z66:Z85)","v":0},null,null,{"$f":"SUM(AC66:AC85)","v":0},null,null,{"$f":"SUM(AF66:AF85)","v":0},null,null,{"$f":"SUM(AI66:AI85)","v":0},null,null,{"$f":"SUM(AL66:AL85)","v":0},null,null,{"$f":"SUM(AO66:AO85)","v":0},null,null,{"$f":"SUM(AR66:AR85)","v":0},null,null,{"$f":"SUM(AU66:AU85)","v":0},null,null,{"$f":"SUM(AX66:AX85)","v":0},null,null,{"$f":"SUM(BA66:BA85)","v":0},null,null,{"$f":"SUM(BD66:BD85)","v":0},null,null,{"$f":"SUM(BG66:BG85)","v":0},null,null,{"$f":"SUM(BJ66:BJ85)","v":0}]
[null,"Tegen uit",null,{"$f":"SUM(D66:D85)","v":0},null,null,{"$f":"SUM(G66:G85)","v":0},null,null,{"$f":"SUM(J66:J85)","v":0},null,null,{"$f":"SUM(M66:M85)","v":0},null,null,{"$f":"SUM(P66:P85)","v":0},null,null,{"$f":"SUM(S66:S85)","v":0},null,null,{"$f":"SUM(V66:V85)","v":0},null,null,{"$f":"SUM(Y66:Y85)","v":0},null,null,{"$f":"SUM(AB66:AB85)","v":0},null,null,{"$f":"SUM(AE66:AE85)","v":0},null,null,{"$f":"SUM(AH66:AH85)","v":0},null,null,{"$f":"SUM(AK66:AK85)","v":0},null,null,{"$f":"SUM(AN66:AN85)","v":0},null,null,{"$f":"SUM(AQ66:AQ85)","v":0},null,null,{"$f":"SUM(AT66:AT85)","v":0},null,null,{"$f":"SUM(AW66:AW85)","v":0},null,null,{"$f":"SUM(AZ66:AZ85)","v":0},null,null,{"$f":"SUM(BC66:BC85)","v":0},null,null,{"$f":"SUM(BF66:BF85)","v":0},null,null,{"$f":"SUM(BI66:BI85)","v":0}]
[]
[]
[]
[null,"Periode 3",null,{"$f":"$B$96","v":"Almere City FC"},null,null,{"$f":"$B$97","v":"FC Den Bosch"},null,null,{"$f":"$B$98","v":"FC Dordrecht"},null,null,{"$f":"$B$99","v":"FC Eindhoven"},null,null,{"$f":"$B$100","v":"FC Twente"},null,null,{"$f":"$B$101","v":"FC Volendam"},null,null,{"$f":"$B$102","v":"Go Ahead Eagles"},null,null,{"$f":"$B$103","v":"Helmond Sport"},null,null,{"$f":"$B$104","v":"Jong Ajax"},null,null,{"$f":"$B$105","v":"Jong AZ Alkmaar"},null,null,{"$f":"$B$106","v":"Jong FC Utrecht"},null,null,{"$f":"$B$107","v":"Jong PSV"},null,null,{"$f":"$B$108","v":"MVV Maastricht"},null,null,{"$f":"$B$109","v":"NEC Nijmegen"},null,null,{"$f":"$B$110","v":"RKC Waalwijk"},null,null,{"$f":"$B$111","v":"Roda JC Kerkrade"},null,null,{"$f":"$B$112","v":"SC Cambuur"},null,null,{"$f":"$B$113","v":"SC Telstar"},null,null,{"$f":"$B$114","v":"Sparta Rotterdam"},null,null,{"$f":"$B$115","v":"TOP Oss"},null,null,"Winst thuis","Gelijk thuis","Verlies thuis","Vóór thuis","Tegen thuis",null,"Plaats","Team","Gespeeld","Winst","Gelijk","Verlies","Straf","Punten","Doelsaldo","Vóór","Tegen","Code"]
[null,{"$f":"BS96","v":"Almere City FC"},null,null,null,null,{"$f":"IFERROR(IF(ISBLANK(VLOOKUP(TEXT($B96,)&\" - \"&TEXT($G$95,),SchemaKK3,2,0)),\"\",VLOOKUP(TEXT($B96,)&\" - \"&TEXT($G$95,),SchemaKK3,2,0)),\"\")","v":""},{"$f":"IFERROR(IF(ISBLANK(VLOOKUP(TEXT($B96,)&\" - \"&TEXT($G$95,),SchemaKK3,3,0)),\"\",VLOOKUP(TEXT($B96,)&\" - \"&TEXT($G$95,),SchemaKK3,3,0)),\"\")","v":""},{"$f":"IF(H96=\"\",\"\",IF(G96>H96,\"w\",IF(G96=H96,\"g\",\"v\")))","v":""},{"$f":"IFERROR(IF(ISBLANK(VLOOKUP(TEXT($B96,)&\" - \"&TEXT($J$95,),SchemaKK3,2,0)),\"\",VLOOKUP(TEXT($B96,)&\" - \"&TEXT($J$95,),SchemaKK3,2,0)),\"\")","v":""},{"$f":"IFERROR(IF(ISBLANK(VLOOKUP(TEXT($B96,)&\" - \"&TEXT($J$95,),SchemaKK3,3,0)),\"\",VLOOKUP(TEXT($B96,)&\" - \"&TEXT($J$95,),SchemaKK3,3,0)),\"\")","v":""},{"$f":"IF(K96=\"\",\"\",IF(J96>K96,\"w\",IF(J96=K96,\"g\",\"v\")))","v":""},{"$f":"IFERROR(IF(ISBLANK(VLOOKUP(TEXT($B96,)&\" - \"&TEXT($M$95,),SchemaKK3,2,0)),\"\",VLOOKUP(TEXT($B96,)&\" - \"&TEXT($M$95,),SchemaKK3,2,0)),\"\")","v":""},{"$f":"IFERROR(IF(ISBLANK(VLOOKUP(TEXT($B96,)&\" - \"&TEXT($M$95,),SchemaKK3,3,0)),\"\",VLOOKUP(TEXT($B96,)&\" - \"&TEXT($M$95,),SchemaKK3,3,0)),\"\")","v":""},{"$f":"IF(N96=\"\",\"\",IF(M96>N96,\"w\",IF(M96=N96,\"g\",\"v\")))","v":""},{"$f":"IFERROR(IF(ISBLANK(VLOOKUP(TEXT($B96,)&\" - \"&TEXT($P$95,),SchemaKK3,2,0)),\"\",VLOOKUP(TEXT($B96,)&\" - \"&TEXT($P$95,),SchemaKK3,2,0)),\"\")","v":""},{"$f":"IFERROR(IF(ISBLANK(VLOOKUP(TEXT($B96,)&\" - \"&TEXT($P$95,),SchemaKK3,3,0)),\"\",VLOOKUP(TEXT($B96,)&\" - \"&TEXT($P$95,),SchemaKK3,3,0)),\"\")","v":""},{"$f":"IF(Q96=\"\",\"\",IF(P96>Q96,\"w\",IF(P96=Q96,\"g\",\"v\")))","v":""},{"$f":"IFERROR(IF(ISBLANK(VLOOKUP(TEXT($B96,)&\" - \"&TEXT($S$95,),SchemaKK3,2,0)),\"\",VLOOKUP(TEXT($B96,)&\" - \"&TEXT($S$95,),SchemaKK3,2,0)),\"\")","v":""},{"$f":"IFERROR(IF(ISBLANK(VLOOKUP(TEXT($B96,)&\" - \"&TEXT($S$95,),SchemaKK3,3,0)),\"\",VLOOKUP(TEXT($B96,)&\" - \"&TEXT($S$95,),SchemaKK3,3,0)),\"\")","v":""},{"$f":"IF(T96=\"\",\"\",IF(S96>T96,\"w\",IF(S96=T96,\"g\",\"v\")))","v":""},{"$f":"IFERROR(IF(ISBLANK(VLOOKUP(TEXT($B96,)&\" - \"&TEXT($V$95,),SchemaKK3,2,0)),\"\",VLOOKUP(TEXT($B96,)&\" - \"&TEXT($V$95,),SchemaKK3,2,0)),\"\")","v":""},{"$f":"IFERROR(IF(ISBLANK(VLOOKUP(TEXT($B96,)&\" - \"&TEXT($V$95,),SchemaKK3,3,0)),\"\",VLOOKUP(TEXT($B96,)&\" - \"&TEXT($V$95,),SchemaKK3,3,0)),\"\")","v":""},{"$f":"IF(W96=\"\",\"\",IF(V96>W96,\"w\",IF(V96=W96,\"g\",\"v\")))","v":""},{"$f":"IFERROR(IF(ISBLANK(VLOOKUP(TEXT($B96,)&\" - \"&TEXT($Y$95,),SchemaKK3,2,0)),\"\",VLOOKUP(TEXT($B96,)&\" - \"&TEXT($Y$95,),SchemaKK3,2,0)),\"\")","v":""},{"$f":"IFERROR(IF(ISBLANK(VLOOKUP(TEXT($B96,)&\" - \"&TEXT($Y$95,),SchemaKK3,3,0)),\"\",VLOOKUP(TEXT($B96,)&\" - \"&TEXT($Y$95,),SchemaKK3,3,0)),\"\")","v":""},{"$f":"IF(Z96=\"\",\"\",IF(Y96>Z96,\"w\",IF(Y96=Z96,\"g\",\"v\")))","v":""},{"$f":"IFERROR(IF(ISBLANK(VLOOKUP(TEXT($B96,)&\" - \"&TEXT($AB$95,),SchemaKK3,2,0)),\"\",VLOOKUP(TEXT($B96,)&\" - \"&TEXT($AB$95,),SchemaKK3,2,0)),\"\")","v":""},{"$f":"IFERROR(IF(ISBLANK(VLOOKUP(TEXT($B96,)&\" - \"&TEXT($AB$95,),SchemaKK3,3,0)),\"\",VLOOKUP(TEXT($B96,)&\" - \"&TEXT($AB$95,),SchemaKK3,3,0)),\"\")","v":""},{"$f":"IF(AC96=\"\",\"\",IF(AB96>AC96,\"w\",IF(AB96=AC96,\"g\",\"v\")))","v":""},{"$f":"IFERROR(IF(ISBLANK(VLOOKUP(TEXT($B96,)&\" - \"&TEXT($AE$95,),SchemaKK3,2,0)),\"\",VLOOKUP(TEXT($B96,)&\" - \"&TEXT($AE$95,),SchemaKK3,2,0)),\"\")","v":""},{"$f":"IFERROR(IF(ISBLANK(VLOOKUP(TEXT($B96,)&\" - \"&TEXT($AE$95,),SchemaKK3,3,0)),\"\",VLOOKUP(TEXT($B96,)&\" - \"&TEXT($AE$95,),SchemaKK3,3,0)),\"\")","v":""},{"$f":"IF(AF96=\"\",\"\",IF(AE96>AF96,\"w\",IF(AE96=AF96,\"g\",\"v\")))","v":""},{"$f":"IFERROR(IF(ISBLANK(VLOOKUP(TEXT($B96,)&\" - \"&TEXT($AH$95,),SchemaKK3,2,0)),\"\",VLOOKUP(TEXT($B96,)&\" - \"&TEXT($AH$95,),SchemaKK3,2,0)),\"\")","v":""},{"$f":"IFERROR(IF(ISBLANK(VLOOKUP(TEXT($B96,)&\" - \"&TEXT($AH$95,),SchemaKK3,3,0)),\"\",VLOOKUP(TEXT($B96,)&\" - \"&TEXT($AH$95,),SchemaKK3,3,0)),\"\")","v":""},{"$f":"IF(AI96=\"\",\"\",IF(AH96>AI96,\"w\",IF(AH96=AI96,\"g\",\"v\")))","v":""},{"$f":"IFERROR(IF(ISBLANK(VLOOKUP(TEXT($B96,)&\" - \"&TEXT($AK$95,),SchemaKK3,2,0)),\"\",VLOOKUP(TEXT($B96,)&\" - \"&TEXT($AK$95,),SchemaKK3,2,0)),\"\")","v":""},{"$f":"IFERROR(IF(ISBLANK(VLOOKUP(TEXT($B96,)&\" - \"&TEXT($AK$95,),SchemaKK3,3,0)),\"\",VLOOKUP(TEXT($B96,)&\" - \"&TEXT($AK$95,),SchemaKK3,3,0)),\"\")","v":""},{"$f":"IF(AL96=\"\",\"\",IF(AK96>AL96,\"w\",IF(AK96=AL96,\"g\",\"v\")))","v":""},{"$f":"IFERROR(IF(ISBLANK(VLOOKUP(TEXT($B96,)&\" - \"&TEXT($AN$95,),SchemaKK3,2,0)),\"\",VLOOKUP(TEXT($B96,)&\" - \"&TEXT($AN$95,),SchemaKK3,2,0)),\"\")","v":""},{"$f":"IFERROR(IF(ISBLANK(VLOOKUP(TEXT($B96,)&\" - \"&TEXT($AN$95,),SchemaKK3,3,0)),\"\",VLOOKUP(TEXT($B96,)&\" - \"&TEXT($AN$95,),SchemaKK3,3,0)),\"\")","v":""},{"$f":"IF(AO96=\"\",\"\",IF(AN96>AO96,\"w\",IF(AN96=AO96,\"g\",\"v\")))","v":""},{"$f":"IFERROR(IF(ISBLANK(VLOOKUP(TEXT($B96,)&\" - \"&TEXT($AQ$95,),SchemaKK3,2,0)),\"\",VLOOKUP(TEXT($B96,)&\" - \"&TEXT($AQ$95,),SchemaKK3,2,0)),\"\")","v":""},{"$f":"IFERROR(IF(ISBLANK(VLOOKUP(TEXT($B96,)&\" - \"&TEXT($AQ$95,),SchemaKK3,3,0)),\"\",VLOOKUP(TEXT($B96,)&\" - \"&TEXT($AQ$95,),SchemaKK3,3,0)),\"\")","v":""},{"$f":"IF(AR96=\"\",\"\",IF(AQ96>AR96,\"w\",IF(AQ96=AR96,\"g\",\"v\")))","v":""},{"$f":"IFERROR(IF(ISBLANK(VLOOKUP(TEXT($B96,)&\" - \"&TEXT($AT$95,),SchemaKK3,2,0)),\"\",VLOOKUP(TEXT($B96,)&\" - \"&TEXT($AT$95,),SchemaKK3,2,0)),\"\")","v":""},{"$f":"IFERROR(IF(ISBLANK(VLOOKUP(TEXT($B96,)&\" - \"&TEXT($AT$95,),SchemaKK3,3,0)),\"\",VLOOKUP(TEXT($B96,)&\" - \"&TEXT($AT$95,),SchemaKK3,3,0)),\"\")","v":""},{"$f":"IF(AU96=\"\",\"\",IF(AT96>AU96,\"w\",IF(AT96=AU96,\"g\",\"v\")))","v":""},{"$f":"IFERROR(IF(ISBLANK(VLOOKUP(TEXT($B96,)&\" - \"&TEXT($AW$95,),SchemaKK3,2,0)),\"\",VLOOKUP(TEXT($B96,)&\" - \"&TEXT($AW$95,),SchemaKK3,2,0)),\"\")","v":""},{"$f":"IFERROR(IF(ISBLANK(VLOOKUP(TEXT($B96,)&\" - \"&TEXT($AW$95,),SchemaKK3,3,0)),\"\",VLOOKUP(TEXT($B96,)&\" - \"&TEXT($AW$95,),SchemaKK3,3,0)),\"\")","v":""},{"$f":"IF(AX96=\"\",\"\",IF(AW96>AX96,\"w\",IF(AW96=AX96,\"g\",\"v\")))","v":""},{"$f":"IFERROR(IF(ISBLANK(VLOOKUP(TEXT($B96,)&\" - \"&TEXT($AZ$95,),SchemaKK3,2,0)),\"\",VLOOKUP(TEXT($B96,)&\" - \"&TEXT($AZ$95,),SchemaKK3,2,0)),\"\")","v":""},{"$f":"IFERROR(IF(ISBLANK(VLOOKUP(TEXT($B96,)&\" - \"&TEXT($AZ$95,),SchemaKK3,3,0)),\"\",VLOOKUP(TEXT($B96,)&\" - \"&TEXT($AZ$95,),SchemaKK3,3,0)),\"\")","v":""},{"$f":"IF(BA96=\"\",\"\",IF(AZ96>BA96,\"w\",IF(AZ96=BA96,\"g\",\"v\")))","v":""},{"$f":"IFERROR(IF(ISBLANK(VLOOKUP(TEXT($B96,)&\" - \"&TEXT($BC$95,),SchemaKK3,2,0)),\"\",VLOOKUP(TEXT($B96,)&\" - \"&TEXT($BC$95,),SchemaKK3,2,0)),\"\")","v":""},{"$f":"IFERROR(IF(ISBLANK(VLOOKUP(TEXT($B96,)&\" - \"&TEXT($BC$95,),SchemaKK3,3,0)),\"\",VLOOKUP(TEXT($B96,)&\" - \"&TEXT($BC$95,),SchemaKK3,3,0)),\"\")","v":""},{"$f":"IF(BD96=\"\",\"\",IF(BC96>BD96,\"w\",IF(BC96=BD96,\"g\",\"v\")))","v":""},{"$f":"IFERROR(IF(ISBLANK(VLOOKUP(TEXT($B96,)&\" - \"&TEXT($BF$95,),SchemaKK3,2,0)),\"\",VLOOKUP(TEXT($B96,)&\" - \"&TEXT($BF$95,),SchemaKK3,2,0)),\"\")","v":""},{"$f":"IFERROR(IF(ISBLANK(VLOOKUP(TEXT($B96,)&\" - \"&TEXT($BF$95,),SchemaKK3,3,0)),\"\",VLOOKUP(TEXT($B96,)&\" - \"&TEXT($BF$95,),SchemaKK3,3,0)),\"\")","v":""},{"$f":"IF(BG96=\"\",\"\",IF(BF96>BG96,\"w\",IF(BF96=BG96,\"g\",\"v\")))","v":""},{"$f":"IFERROR(IF(ISBLANK(VLOOKUP(TEXT($B96,)&\" - \"&TEXT($BI$95,),SchemaKK3,2,0)),\"\",VLOOKUP(TEXT($B96,)&\" - \"&TEXT($BI$95,),SchemaKK3,2,0)),\"\")","v":""},{"$f":"IFERROR(IF(ISBLANK(VLOOKUP(TEXT($B96,)&\" - \"&TEXT($BI$95,),SchemaKK3,3,0)),\"\",VLOOKUP(TEXT($B96,)&\" - \"&TEXT($BI$95,),SchemaKK3,3,0)),\"\")","v":""},{"$f":"IF(BJ96=\"\",\"\",IF(BI96>BJ96,\"w\",IF(BI96=BJ96,\"g\",\"v\")))","v":""},{"$f":"COUNTIF(F96:BK96,\"w\")","v":0},{"$f":"COUNTIF(F96:BK96,\"g\")","v":0},{"$f":"COUNTIF(F96:BK96,\"v\")","v":0},{"$f":"SUM(D96,G96,J96,M96,P96,S96,V96,Y96,AB96,AE96,AH96,AK96,AN96,AQ96,AT96,AW96,AZ96,BC96,BF96,BI96)","v":0},{"$f":"SUM(E96,H96,K96,N96,Q96,T96,W96,Z96,AC96,AF96,AI96,AL96,AO96,AR96,AU96,AX96,BA96,BD96,BG96,BJ96)","v":0},null,{"$f":"RANK(CC96,$CC$96:$CC$115)","v":1},"Almere City FC",{"$f":"SUM(BU96:BW96)","v":0},{"$f":"INDEX($BL$96:$BL$115,MATCH(BS96,$B$96:$B$115,0))+INDEX($D$117:$BJ$117,MATCH(BS96,$D$95:$BJ$95,0))","v":0},{"$f":"INDEX($BM$96:$BM$115,MATCH(BS96,$B$96:$B$116,0))+INDEX($D$118:$BJ$118,MATCH(BS96,$D$95:$BJ$95,0))","v":0},{"$f":"INDEX($BN$96:$BN$115,MATCH(BS96,$B$96:$B$115,0))+INDEX($D$119:$BJ$119,MATCH(BS96,$D$95:$BJ$95,0))","v":0},null,{"$f":"(BU96*3)+BV96+BX96","v":0},{"$f":"CA96-CB96","v":0},{"$f":"INDEX($BO$96:$BO$115,MATCH(BS96,$B$96:$B$115,0))+INDEX($D$120:$BJ$120,MATCH(BS96,$D$95:$BJ$95,0))","v":0},{"$f":"INDEX($BP$96:$BP$115,MATCH(BS96,$B$96:$B$115,0))+INDEX($D$121:$BJ$121,MATCH(BS96,$D$95:$BJ$95,0))","v":0},{"$f":"VALUE(TEXT(BY96,\"000\")&TEXT(100+BZ96,\"000\")&TEXT(CA96,\"000\")&TEXT(100-BT96,\"00\")&TEXT(COUNTIF($BS$96:$BS$115,\">=\"&BS96),\"00\"))","v":10000010020}]
[null,{"$f":"BS97","v":"FC Den Bosch"},null,{"$f":"IFERROR(IF(ISBLANK(VLOOKUP(TEXT($B97,)&\" - \"&TEXT($D$95,),SchemaKK3,3,0)),\"\",VLOOKUP(TEXT($B97,)&\" - \"&TEXT($D$95,),SchemaKK3,3,0)),\"\")","v":""},{"$f":"IFERROR(IF(ISBLANK(VLOOKUP(TEXT($B97,)&\" - \"&TEXT($D$95,),SchemaKK3,3,0)),\"\",VLOOKUP(TEXT($B97,)&\" - \"&TEXT($D$95,),SchemaKK3,3,0)),\"\")","v":""},{"$f":"IF(E97=\"\",\"\",IF(D97>E97,\"w\",IF(D97=E97,\"g\",\"v\")))","v":""},null,null,null,{"$f":"IFERROR(IF(ISBLANK(VLOOKUP(TEXT($B97,)&\" - \"&TEXT($J$95,),SchemaKK3,2,0)),\"\",VLOOKUP(TEXT($B97,)&\" - \"&TEXT($J$95,),SchemaKK3,2,0)),\"\")","v":""},{"$f":"IFERROR(IF(ISBLANK(VLOOKUP(TEXT($B97,)&\" - \"&TEXT($J$95,),SchemaKK3,3,0)),\"\",VLOOKUP(TEXT($B97,)&\" - \"&TEXT($J$95,),SchemaKK3,3,0)),\"\")","v":""},"",{"$f":"IFERROR(IF(ISBLANK(VLOOKUP(TEXT($B97,)&\" - \"&TEXT($M$95,),SchemaKK3,2,0)),\"\",VLOOKUP(TEXT($B97,)&\" - \"&TEXT($M$95,),SchemaKK3,2,0)),\"\")","v":""},{"$f":"IFERROR(IF(ISBLANK(VLOOKUP(TEXT($B97,)&\" - \"&TEXT($M$95,),SchemaKK3,3,0)),\"\",VLOOKUP(TEXT($B97,)&\" - \"&TEXT($M$95,),SchemaKK3,3,0)),\"\")","v":""},"",{"$f":"IFERROR(IF(ISBLANK(VLOOKUP(TEXT($B97,)&\" - \"&TEXT($P$95,),SchemaKK3,2,0)),\"\",VLOOKUP(TEXT($B97,)&\" - \"&TEXT($P$95,),SchemaKK3,2,0)),\"\")","v":""},{"$f":"IFERROR(IF(ISBLANK(VLOOKUP(TEXT($B97,)&\" - \"&TEXT($P$95,),SchemaKK3,3,0)),\"\",VLOOKUP(TEXT($B97,)&\" - \"&TEXT($P$95,),SchemaKK3,3,0)),\"\")","v":""},"",{"$f":"IFERROR(IF(ISBLANK(VLOOKUP(TEXT($B97,)&\" - \"&TEXT($S$95,),SchemaKK3,2,0)),\"\",VLOOKUP(TEXT($B97,)&\" - \"&TEXT($S$95,),SchemaKK3,2,0)),\"\")","v":""},{"$f":"IFERROR(IF(ISBLANK(VLOOKUP(TEXT($B97,)&\" - \"&TEXT($S$95,),SchemaKK3,3,0)),\"\",VLOOKUP(TEXT($B97,)&\" - \"&TEXT($S$95,),SchemaKK3,3,0)),\"\")","v":""},"","","","","","","","","","","","","","","","","","","","","","","","","","","","","","","","","","","","","","","","","","","",0,0,0,0,0,null,2,"FC Den Bosch",0,0,0,0,null,0,0,0,0,10000010019]
[null,"FC Dordrecht",null,"","","",{"$f":"IFERROR(IF(ISBLANK(VLOOKUP(TEXT($B98,)&\" - \"&TEXT($G$95,),SchemaKK3,2,0)),\"\",VLOOKUP(TEXT($B98,)&\" - \"&TEXT($G$95,),SchemaKK3,2,0)),\"\")","v":""},{"$f":"IFERROR(IF(ISBLANK(VLOOKUP(TEXT($B98,)&\" - \"&TEXT($G$95,),SchemaKK3,3,0)),\"\",VLOOKUP(TEXT($B98,)&\" - \"&TEXT($G$95,),SchemaKK3,3,0)),\"\")","v":""},"",null,null,null,{"$f":"IFERROR(IF(ISBLANK(VLOOKUP(TEXT($B98,)&\" - \"&TEXT($M$95,),SchemaKK3,2,0)),\"\",VLOOKUP(TEXT($B98,)&\" - \"&TEXT($M$95,),SchemaKK3,2,0)),\"\")","v":""},{"$f":"IFERROR(IF(ISBLANK(VLOOKUP(TEXT($B98,)&\" - \"&TEXT($M$95,),SchemaKK3,3,0)),\"\",VLOOKUP(TEXT($B98,)&\" - \"&TEXT($M$95,),SchemaKK3,3,0)),\"\")","v":""},"",{"$f":"IFERROR(IF(ISBLANK(VLOOKUP(TEXT($B98,)&\" - \"&TEXT($P$95,),SchemaKK3,2,0)),\"\",VLOOKUP(TEXT($B98,)&\" - \"&TEXT($P$95,),SchemaKK3,2,0)),\"\")","v":""},{"$f":"IFERROR(IF(ISBLANK(VLOOKUP(TEXT($B98,)&\" - \"&TEXT($P$95,),SchemaKK3,3,0)),\"\",VLOOKUP(TEXT($B98,)&\" - \"&TEXT($P$95,),SchemaKK3,3,0)),\"\")","v":""},"",{"$f":"IFERROR(IF(ISBLANK(VLOOKUP(TEXT($B98,)&\" - \"&TEXT($S$95,),SchemaKK3,2,0)),\"\",VLOOKUP(TEXT($B98,)&\" - \"&TEXT($S$95,),SchemaKK3,2,0)),\"\")","v":""},{"$f":"IFERROR(IF(ISBLANK(VLOOKUP(TEXT($B98,)&\" - \"&TEXT($S$95,),SchemaKK3,3,0)),\"\",VLOOKUP(TEXT($B98,)&\" - \"&TEXT($S$95,),SchemaKK3,3,0)),\"\")","v":""},"","","","","","","","","","","","","","","","","","","","","","","","","","","","","","","","","","","","","","","","","","","",0,0,0,0,0,null,3,"FC Dordrecht",0,0,0,0,null,0,0,0,0,10000010018]
[null,"FC Eindhoven",null,"","","","","","",{"$f":"IFERROR(IF(ISBLANK(VLOOKUP(TEXT($B99,)&\" - \"&TEXT($J$95,),SchemaKK3,2,0)),\"\",VLOOKUP(TEXT($B99,)&\" - \"&TEXT($J$95,),SchemaKK3,2,0)),\"\")","v":""},{"$f":"IFERROR(IF(ISBLANK(VLOOKUP(TEXT($B99,)&\" - \"&TEXT($J$95,),SchemaKK3,3,0)),\"\",VLOOKUP(TEXT($B99,)&\" - \"&TEXT($J$95,),SchemaKK3,3,0)),\"\")","v":""},"",null,null,null,{"$f":"IFERROR(IF(ISBLANK(VLOOKUP(TEXT($B99,)&\" - \"&TEXT($P$95,),SchemaKK3,2,0)),\"\",VLOOKUP(TEXT($B99,)&\" - \"&TEXT($P$95,),SchemaKK3,2,0)),\"\")","v":""},{"$f":"IFERROR(IF(ISBLANK(VLOOKUP(TEXT($B99,)&\" - \"&TEXT($P$95,),SchemaKK3,3,0)),\"\",VLOOKUP(TEXT($B99,)&\" - \"&TEXT($P$95,),SchemaKK3,3,0)),\"\")","v":""},"",{"$f":"IFERROR(IF(ISBLANK(VLOOKUP(TEXT($B99,)&\" - \"&TEXT($S$95,),SchemaKK3,2,0)),\"\",VLOOKUP(TEXT($B99,)&\" - \"&TEXT($S$95,),SchemaKK3,2,0)),\"\")","v":""},{"$f":"IFERROR(IF(ISBLANK(VLOOKUP(TEXT($B99,)&\" - \"&TEXT($S$95,),SchemaKK3,3,0)),\"\",VLOOKUP(TEXT($B99,)&\" - \"&TEXT($S$95,),SchemaKK3,3,0)),\"\")","v":""},"","","","","","","","","","","","","","","","","","","","","","","","","","","","","","","","","","","","","","","","","","","",0,0,0,0,0,null,4,"FC Eindhoven",0,0,0,0,null,0,0,0,0,10000010017]
[null,"FC Twente",null,"","","","","","","","","",{"$f":"IFERROR(IF(ISBLANK(VLOOKUP(TEXT($B100,)&\" - \"&TEXT($M$95,),SchemaKK3,2,0)),\"\",VLOOKUP(TEXT($B100,)&\" - \"&TEXT($M$95,),SchemaKK3,2,0)),\"\")","v":""},{"$f":"IFERROR(IF(ISBLANK(VLOOKUP(TEXT($B100,)&\" - \"&TEXT($M$95,),SchemaKK3,3,0)),\"\",VLOOKUP(TEXT($B100,)&\" - \"&TEXT($M$95,),SchemaKK3,3,0)),\"\")","v":""},"",null,null,null,{"$f":"IFERROR(IF(ISBLANK(VLOOKUP(TEXT($B100,)&\" - \"&TEXT($S$95,),SchemaKK3,2,0)),\"\",VLOOKUP(TEXT($B100,)&\" - \"&TEXT($S$95,),SchemaKK3,2,0)),\"\")","v":""},{"$f":"IFERROR(IF(ISBLANK(VLOOKUP(TEXT($B100,)&\" - \"&TEXT($S$95,),SchemaKK3,3,0)),\"\",VLOOKUP(TEXT($B100,)&\" - \"&TEXT($S$95,),SchemaKK3,3,0)),\"\")","v":""},"","","","","","","","","","","","","","","","","","","","","","","","","","","","","","","","","","","","","","","","","","","",0,0,0,0,0,null,5,"FC Twente",0,0,0,0,null,0,0,0,0,10000010016]
[null,"FC Volendam",null,"","","","","","","","","","","","",{"$f":"IFERROR(IF(ISBLANK(VLOOKUP(TEXT($B101,)&\" - \"&TEXT($P$95,),SchemaKK3,2,0)),\"\",VLOOKUP(TEXT($B101,)&\" - \"&TEXT($P$95,),SchemaKK3,2,0)),\"\")","v":""},{"$f":"IFERROR(IF(ISBLANK(VLOOKUP(TEXT($B101,)&\" - \"&TEXT($P$95,),SchemaKK3,3,0)),\"\",VLOOKUP(TEXT($B101,)&\" - \"&TEXT($P$95,),SchemaKK3,3,0)),\"\")","v":""},"",null,null,null,"","","","","","","","","","","","","","","","","","","","","","","","","","","","","","","","","","","","","","","","","","",0,0,0,0,0,null,6,"FC Volendam",0,0,0,0,null,0,0,0,0,10000010015]
[null,"Go Ahead Eagles",null,"","","","","","","","","","","","","","","",{"$f":"IFERROR(IF(ISBLANK(VLOOKUP(TEXT($B102,)&\" - \"&TEXT($S$95,),SchemaKK3,2,0)),\"\",VLOOKUP(TEXT($B102,)&\" - \"&TEXT($S$95,),SchemaKK3,2,0)),\"\")","v":""},{"$f":"IFERROR(IF(ISBLANK(VLOOKUP(TEXT($B102,)&\" - \"&TEXT($S$95,),SchemaKK3,3,0)),\"\",VLOOKUP(TEXT($B102,)&\" - \"&TEXT($S$95,),SchemaKK3,3,0)),\"\")","v":""},"",null,null,null,"","","","","","","","","","","","","","","","","","","","","","","","","","","","","","","","","","","","","","","",0,0,0,0,0,null,7,"Go Ahead Eagles",0,0,0,0,null,0,0,0,0,10000010014]
[null,"Helmond Sport",null,"","","","","","","","","","","","","","","","","","",{"$f":"IFERROR(IF(ISBLANK(VLOOKUP(TEXT($B103,)&\" - \"&TEXT($V$95,),SchemaKK3,2,0)),\"\",VLOOKUP(TEXT($B103,)&\" - \"&TEXT($V$95,),SchemaKK3,2,0)),\"\")","v":""},{"$f":"IFERROR(IF(ISBLANK(VLOOKUP(TEXT($B103,)&\" - \"&TEXT($V$95,),SchemaKK3,3,0)),\"\",VLOOKUP(TEXT($B103,)&\" - \"&TEXT($V$95,),SchemaKK3,3,0)),\"\")","v":""},"",null,null,null,"","","","","","","","","","","","","","","","","","","","","","","","","","","","","","","","","","","","",0,0,0,0,0,null,8,"Helmond Sport",0,0,0,0,null,0,0,0,0,10000010013]
[null,"Jong Ajax",null,"","","","","","","","","","","","","","","","","","","","","",{"$f":"IFERROR(IF(ISBLANK(VLOOKUP(TEXT($B104,)&\" - \"&TEXT($Y$95,),SchemaKK3,2,0)),\"\",VLOOKUP(TEXT($B104,)&\" - \"&TEXT($Y$95,),SchemaKK3,2,0)),\"\")","v":""},{"$f":"IFERROR(IF(ISBLANK(VLOOKUP(TEXT($B104,)&\" - \"&TEXT($Y$95,),SchemaKK3,3,0)),\"\",VLOOKUP(TEXT($B104,)&\" - \"&TEXT($Y$95,),SchemaKK3,3,0)),\"\")","v":""},"",null,null,null,"","","","","","","","","","","","","","","","","","","","","","","","","","","","","","","","","",0,0,0,0,0,null,9,"Jong Ajax",0,0,0,0,null,0,0,0,0,10000010012]
[null,"Jong AZ Alkmaar",null,"","","","","","","","","","","","","","","","","","","","","","","","",{"$f":"IFERROR(IF(ISBLANK(VLOOKUP(TEXT($B105,)&\" - \"&TEXT($AB$95,),SchemaKK3,2,0)),\"\",VLOOKUP(TEXT($B105,)&\" - \"&TEXT($AB$95,),SchemaKK3,2,0)),\"\")","v":""},{"$f":"IFERROR(IF(ISBLANK(VLOOKUP(TEXT($B105,)&\" - \"&TEXT($AB$95,),SchemaKK3,3,0)),\"\",VLOOKUP(TEXT($B105,)&\" - \"&TEXT($AB$95,),SchemaKK3,3,0)),\"\")","v":""},"",null,null,null,"","","","","","","","","","","","","","","","","","","","","","","","","","","","","","",0,0,0,0,0,null,10,"Jong AZ Alkmaar",0,0,0,0,null,0,0,0,0,10000010011]
[null,"Jong FC Utrecht",null,"","","","","","","","","","","","","","","","","","","","","","","","","","","",{"$f":"IFERROR(IF(ISBLANK(VLOOKUP(TEXT($B106,)&\" - \"&TEXT($AE$95,),SchemaKK3,2,0)),\"\",VLOOKUP(TEXT($B106,)&\" - \"&TEXT($AE$95,),SchemaKK3,2,0)),\"\")","v":""},{"$f":"IFERROR(IF(ISBLANK(VLOOKUP(TEXT($B106,)&\" - \"&TEXT($AE$95,),SchemaKK3,3,0)),\"\",VLOOKUP(TEXT($B106,)&\" - \"&TEXT($AE$95,),SchemaKK3,3,0)),\"\")","v":""},"",null,null,null,"","","","","","","","","","","","","","","","","","","","","","","","","","","",0,0,0,0,0,null,11,"Jong FC Utrecht",0,0,0,0,null,0,0,0,0,10000010010]
[null,"Jong PSV",null,"","","","","","","","","","","","","","","","","","","","","","","","","","","","","","",{"$f":"IFERROR(IF(ISBLANK(VLOOKUP(TEXT($B107,)&\" - \"&TEXT($AH$95,),SchemaKK3,2,0)),\"\",VLOOKUP(TEXT($B107,)&\" - \"&TEXT($AH$95,),SchemaKK3,2,0)),\"\")","v":""},{"$f":"IFERROR(IF(ISBLANK(VLOOKUP(TEXT($B107,)&\" - \"&TEXT($AH$95,),SchemaKK3,3,0)),\"\",VLOOKUP(TEXT($B107,)&\" - \"&TEXT($AH$95,),SchemaKK3,3,0)),\"\")","v":""},"",null,null,null,"","","","","","","","","","","","","","","","","","","","","","","","",0,0,0,0,0,null,12,"Jong PSV",0,0,0,0,null,0,0,0,0,10000010009]
[null,"MVV Maastricht",null,"","","","","","","","","","","","","","","","","","","","","","","","","","","","","","","","","",{"$f":"IFERROR(IF(ISBLANK(VLOOKUP(TEXT($B108,)&\" - \"&TEXT($AK$95,),SchemaKK3,2,0)),\"\",VLOOKUP(TEXT($B108,)&\" - \"&TEXT($AK$95,),SchemaKK3,2,0)),\"\")","v":""},{"$f":"IFERROR(IF(ISBLANK(VLOOKUP(TEXT($B108,)&\" - \"&TEXT($AK$95,),SchemaKK3,3,0)),\"\",VLOOKUP(TEXT($B108,)&\" - \"&TEXT($AK$95,),SchemaKK3,3,0)),\"\")","v":""},"",null,null,null,"","","","","","","","","","","","","","","","","","","","","",0,0,0,0,0,null,13,"MVV Maastricht",0,0,0,0,null,0,0,0,0,10000010008]
[null,"NEC Nijmegen",null,"","","","","","","","","","","","","","","","","","","","","","","","","","","","","","","","","","","","",{"$f":"IFERROR(IF(ISBLANK(VLOOKUP(TEXT($B109,)&\" - \"&TEXT($AN$95,),SchemaKK3,2,0)),\"\",VLOOKUP(TEXT($B109,)&\" - \"&TEXT($AN$95,),SchemaKK3,2,0)),\"\")","v":""},{"$f":"IFERROR(IF(ISBLANK(VLOOKUP(TEXT($B109,)&\" - \"&TEXT($AN$95,),SchemaKK3,3,0)),\"\",VLOOKUP(TEXT($B109,)&\" - \"&TEXT($AN$95,),SchemaKK3,3,0)),\"\")","v":""},"",null,null,null,"","","","","","","","","","","","","","","","","","",0,0,0,0,0,null,14,"NEC Nijmegen",0,0,0,0,null,0,0,0,0,10000010007]
[null,"RKC Waalwijk",null,"","","","","","","","","","","","","","","","","","","","","","","","","","","","","","","","","","","","","","","",{"$f":"IFERROR(IF(ISBLANK(VLOOKUP(TEXT($B110,)&\" - \"&TEXT($AQ$95,),SchemaKK3,2,0)),\"\",VLOOKUP(TEXT($B110,)&\" - \"&TEXT($AQ$95,),SchemaKK3,2,0)),\"\")","v":""},{"$f":"IFERROR(IF(ISBLANK(VLOOKUP(TEXT($B110,)&\" - \"&TEXT($AQ$95,),SchemaKK3,3,0)),\"\",VLOOKUP(TEXT($B110,)&\" - \"&TEXT($AQ$95,),SchemaKK3,3,0)),\"\")","v":""},"",null,null,null,"","","","","","","","","","","","","","","",0,0,0,0,0,null,15,"RKC Waalwijk",0,0,0,0,null,0,0,0,0,10000010006]
[null,"Roda JC Kerkrade",null,"","","","","","","","","","","","","","","","","","","","","","","","","","","","","","","","","","","","","","","","","","",{"$f":"IFERROR(IF(ISBLANK(VLOOKUP(TEXT($B111,)&\" - \"&TEXT($AT$95,),SchemaKK3,2,0)),\"\",VLOOKUP(TEXT($B111,)&\" - \"&TEXT($AT$95,),SchemaKK3,2,0)),\"\")","v":""},{"$f":"IFERROR(IF(ISBLANK(VLOOKUP(TEXT($B111,)&\" - \"&TEXT($AT$95,),SchemaKK3,3,0)),\"\",VLOOKUP(TEXT($B111,)&\" - \"&TEXT($AT$95,),SchemaKK3,3,0)),\"\")","v":""},"",null,null,null,"","","","","","","","","","","","",0,0,0,0,0,null,16,"Roda JC Kerkrade",0,0,0,0,null,0,0,0,0,10000010005]
[null,"SC Cambuur",null,"","","","","","","","","","","","","","","","","","","","","","","","","","","","","","","","","","","","","","","","","","",{"$f":"IFERROR(IF(ISBLANK(VLOOKUP(TEXT($B112,)&\" - \"&TEXT($AT$95,),SchemaKK3,2,0)),\"\",VLOOKUP(TEXT($B112,)&\" - \"&TEXT($AT$95,),SchemaKK3,2,0)),\"\")","v":""},{"$f":"IFERROR(IF(ISBLANK(VLOOKUP(TEXT($B112,)&\" - \"&TEXT($AT$95,),SchemaKK3,3,0)),\"\",VLOOKUP(TEXT($B112,)&\" - \"&TEXT($AT$95,),SchemaKK3,3,0)),\"\")","v":""},"",{"$f":"IFERROR(IF(ISBLANK(VLOOKUP(TEXT($B112,)&\" - \"&TEXT($AW$95,),SchemaKK3,2,0)),\"\",VLOOKUP(TEXT($B112,)&\" - \"&TEXT($AW$95,),SchemaKK3,2,0)),\"\")","v":""},{"$f":"IFERROR(IF(ISBLANK(VLOOKUP(TEXT($B112,)&\" - \"&TEXT($AW$95,),SchemaKK3,3,0)),\"\",VLOOKUP(TEXT($B112,)&\" - \"&TEXT($AW$95,),SchemaKK3,3,0)),\"\")","v":""},"",null,null,null,"","","","","","","","","",0,0,0,0,0,null,17,"SC Cambuur",0,0,0,0,null,0,0,0,0,10000010004]
[null,"SC Telstar",null,"","","","","","","","","","","","","","","","","","","","","","","","","","","","","","","","","","","","","","","","","","",{"$f":"IFERROR(IF(ISBLANK(VLOOKUP(TEXT($B113,)&\" - \"&TEXT($AT$95,),SchemaKK3,2,0)),\"\",VLOOKUP(TEXT($B113,)&\" - \"&TEXT($AT$95,),SchemaKK3,2,0)),\"\")","v":""},{"$f":"IFERROR(IF(ISBLANK(VLOOKUP(TEXT($B113,)&\" - \"&TEXT($AT$95,),SchemaKK3,3,0)),\"\",VLOOKUP(TEXT($B113,)&\" - \"&TEXT($AT$95,),SchemaKK3,3,0)),\"\")","v":""},"",{"$f":"IFERROR(IF(ISBLANK(VLOOKUP(TEXT($B113,)&\" - \"&TEXT($AW$95,),SchemaKK3,2,0)),\"\",VLOOKUP(TEXT($B113,)&\" - \"&TEXT($AW$95,),SchemaKK3,2,0)),\"\")","v":""},{"$f":"IFERROR(IF(ISBLANK(VLOOKUP(TEXT($B113,)&\" - \"&TEXT($AW$95,),SchemaKK3,3,0)),\"\",VLOOKUP(TEXT($B113,)&\" - \"&TEXT($AW$95,),SchemaKK3,3,0)),\"\")","v":""},"",{"$f":"IFERROR(IF(ISBLANK(VLOOKUP(TEXT($B113,)&\" - \"&TEXT($AZ$95,),SchemaKK3,2,0)),\"\",VLOOKUP(TEXT($B113,)&\" - \"&TEXT($AZ$95,),SchemaKK3,2,0)),\"\")","v":""},{"$f":"IFERROR(IF(ISBLANK(VLOOKUP(TEXT($B113,)&\" - \"&TEXT($AZ$95,),SchemaKK3,3,0)),\"\",VLOOKUP(TEXT($B113,)&\" - \"&TEXT($AZ$95,),SchemaKK3,3,0)),\"\")","v":""},"",null,null,null,"","","","","","",0,0,0,0,0,null,18,"SC Telstar",0,0,0,0,null,0,0,0,0,10000010003]
[null,"Sparta Rotterdam",null,"","","","","","","","","","","","","","","","","","","","","","","","","","","","","","","","","","","","","","","","","","",{"$f":"IFERROR(IF(ISBLANK(VLOOKUP(TEXT($B114,)&\" - \"&TEXT($AT$95,),SchemaKK3,2,0)),\"\",VLOOKUP(TEXT($B114,)&\" - \"&TEXT($AT$95,),SchemaKK3,2,0)),\"\")","v":""},{"$f":"IFERROR(IF(ISBLANK(VLOOKUP(TEXT($B114,)&\" - \"&TEXT($AT$95,),SchemaKK3,3,0)),\"\",VLOOKUP(TEXT($B114,)&\" - \"&TEXT($AT$95,),SchemaKK3,3,0)),\"\")","v":""},"",{"$f":"IFERROR(IF(ISBLANK(VLOOKUP(TEXT($B114,)&\" - \"&TEXT($AW$95,),SchemaKK3,2,0)),\"\",VLOOKUP(TEXT($B114,)&\" - \"&TEXT($AW$95,),SchemaKK3,2,0)),\"\")","v":""},{"$f":"IFERROR(IF(ISBLANK(VLOOKUP(TEXT($B114,)&\" - \"&TEXT($AW$95,),SchemaKK3,3,0)),\"\",VLOOKUP(TEXT($B114,)&\" - \"&TEXT($AW$95,),SchemaKK3,3,0)),\"\")","v":""},"",{"$f":"IFERROR(IF(ISBLANK(VLOOKUP(TEXT($B114,)&\" - \"&TEXT($AZ$95,),SchemaKK3,2,0)),\"\",VLOOKUP(TEXT($B114,)&\" - \"&TEXT($AZ$95,),SchemaKK3,2,0)),\"\")","v":""},{"$f":"IFERROR(IF(ISBLANK(VLOOKUP(TEXT($B114,)&\" - \"&TEXT($AZ$95,),SchemaKK3,3,0)),\"\",VLOOKUP(TEXT($B114,)&\" - \"&TEXT($AZ$95,),SchemaKK3,3,0)),\"\")","v":""},"",{"$f":"IFERROR(IF(ISBLANK(VLOOKUP(TEXT($B114,)&\" - \"&TEXT($BC$95,),SchemaKK3,2,0)),\"\",VLOOKUP(TEXT($B114,)&\" - \"&TEXT($BC$95,),SchemaKK3,2,0)),\"\")","v":""},{"$f":"IFERROR(IF(ISBLANK(VLOOKUP(TEXT($B114,)&\" - \"&TEXT($BC$95,),SchemaKK3,3,0)),\"\",VLOOKUP(TEXT($B114,)&\" - \"&TEXT($BC$95,),SchemaKK3,3,0)),\"\")","v":""},"",null,null,null,"","","",0,0,0,0,0,null,19,"Sparta Rotterdam",0,0,0,0,null,0,0,0,0,10000010002]
[null,"TOP Oss",null,"","","","","","","","","","","","","","","","","","","","","","","","","","","","","","","","","","","","","","","","","","",{"$f":"IFERROR(IF(ISBLANK(VLOOKUP(TEXT($B115,)&\" - \"&TEXT($AT$95,),SchemaKK3,2,0)),\"\",VLOOKUP(TEXT($B115,)&\" - \"&TEXT($AT$95,),SchemaKK3,2,0)),\"\")","v":""},{"$f":"IFERROR(IF(ISBLANK(VLOOKUP(TEXT($B115,)&\" - \"&TEXT($AT$95,),SchemaKK3,3,0)),\"\",VLOOKUP(TEXT($B115,)&\" - \"&TEXT($AT$95,),SchemaKK3,3,0)),\"\")","v":""},"",{"$f":"IFERROR(IF(ISBLANK(VLOOKUP(TEXT($B115,)&\" - \"&TEXT($AW$95,),SchemaKK3,2,0)),\"\",VLOOKUP(TEXT($B115,)&\" - \"&TEXT($AW$95,),SchemaKK3,2,0)),\"\")","v":""},{"$f":"IFERROR(IF(ISBLANK(VLOOKUP(TEXT($B115,)&\" - \"&TEXT($AW$95,),SchemaKK3,3,0)),\"\",VLOOKUP(TEXT($B115,)&\" - \"&TEXT($AW$95,),SchemaKK3,3,0)),\"\")","v":""},"",{"$f":"IFERROR(IF(ISBLANK(VLOOKUP(TEXT($B115,)&\" - \"&TEXT($AZ$95,),SchemaKK3,2,0)),\"\",VLOOKUP(TEXT($B115,)&\" - \"&TEXT($AZ$95,),SchemaKK3,2,0)),\"\")","v":""},{"$f":"IFERROR(IF(ISBLANK(VLOOKUP(TEXT($B115,)&\" - \"&TEXT($AZ$95,),SchemaKK3,3,0)),\"\",VLOOKUP(TEXT($B115,)&\" - \"&TEXT($AZ$95,),SchemaKK3,3,0)),\"\")","v":""},"",{"$f":"IFERROR(IF(ISBLANK(VLOOKUP(TEXT($B115,)&\" - \"&TEXT($BC$95,),SchemaKK3,2,0)),\"\",VLOOKUP(TEXT($B115,)&\" - \"&TEXT($BC$95,),SchemaKK3,2,0)),\"\")","v":""},{"$f":"IFERROR(IF(ISBLANK(VLOOKUP(TEXT($B115,)&\" - \"&TEXT($BC$95,),SchemaKK3,3,0)),\"\",VLOOKUP(TEXT($B115,)&\" - \"&TEXT($BC$95,),SchemaKK3,3,0)),\"\")","v":""},"",{"$f":"IFERROR(IF(ISBLANK(VLOOKUP(TEXT($B115,)&\" - \"&TEXT($BF$95,),SchemaKK3,2,0)),\"\",VLOOKUP(TEXT($B115,)&\" - \"&TEXT($BF$95,),SchemaKK3,2,0)),\"\")","v":""},{"$f":"IFERROR(IF(ISBLANK(VLOOKUP(TEXT($B115,)&\" - \"&TEXT($BF$95,),SchemaKK3,3,0)),\"\",VLOOKUP(TEXT($B115,)&\" - \"&TEXT($BF$95,),SchemaKK3,3,0)),\"\")","v":""},"",null,null,null,0,0,0,0,0,null,20,"TOP Oss",0,0,0,0,null,0,0,0,0,10000010001]
[]
[null,"Winst uit",null,{"$f":"COUNTIF(F$96:F$115,\"v\")","v":0},null,null,{"$f":"COUNTIF(I$96:I$115,\"v\")","v":0},null,null,{"$f":"COUNTIF(L$96:L$115,\"v\")","v":0},null,null,{"$f":"COUNTIF(O$96:O$115,\"v\")","v":0},null,null,{"$f":"COUNTIF(R$96:R$115,\"v\")","v":0},null,null,{"$f":"COUNTIF(U$96:U$115,\"v\")","v":0},null,null,{"$f":"COUNTIF(X$96:X$115,\"v\")","v":0},null,null,{"$f":"COUNTIF(AA$96:AA$115,\"v\")","v":0},null,null,{"$f":"COUNTIF(AD$96:AD$115,\"v\")","v":0},null,null,{"$f":"COUNTIF(AG$96:AG$115,\"v\")","v":0},null,null,{"$f":"COUNTIF(AJ$96:AJ$115,\"v\")","v":0},null,null,{"$f":"COUNTIF(AM$96:AM$115,\"v\")","v":0},null,null,{"$f":"COUNTIF(AP$96:AP$115,\"v\")","v":0},null,null,{"$f":"COUNTIF(AS$96:AS$115,\"v\")","v":0},null,null,{"$f":"COUNTIF(AV$96:AV$115,\"v\")","v":0},null,null,{"$f":"COUNTIF(AY$96:AY$115,\"v\")","v":0},null,null,{"$f":"COUNTIF(BB$96:BB$115,\"v\")","v":0},null,null,{"$f":"COUNTIF(BE$96:BE$115,\"v\")","v":0},null,null,{"$f":"COUNTIF(BH$96:BH$115,\"v\")","v":0},null,null,{"$f":"COUNTIF(BK$96:BK$115,\"v\")","v":0},null,null,null,null,null,null,null,null,null,"Periodekampioen of vervanger"]
[null,"Gelijk uit",null,{"$f":"COUNTIF(F$96:F$115,\"g\")","v":0},null,null,{"$f":"COUNTIF(I$96:I$115,\"g\")","v":0},null,null,{"$f":"COUNTIF(L$96:L$115,\"g\")","v":0},null,null,{"$f":"COUNTIF(O$96:O$115,\"g\")","v":0},null,null,{"$f":"COUNTIF(R$96:R$115,\"g\")","v":0},null,null,{"$f":"COUNTIF(U$96:U$115,\"g\")","v":0},null,null,{"$f":"COUNTIF(X$96:X$115,\"g\")","v":0},null,null,{"$f":"COUNTIF(AA$96:AA$115,\"g\")","v":0},null,null,{"$f":"COUNTIF(AD$96:AD$115,\"g\")","v":0},null,null,{"$f":"COUNTIF(AG$96:AG$115,\"g\")","v":0},null,null,{"$f":"COUNTIF(AJ$96:AJ$115,\"g\")","v":0},null,null,{"$f":"COUNTIF(AM$96:AM$115,\"g\")","v":0},null,null,{"$f":"COUNTIF(AP$96:AP$115,\"g\")","v":0},null,null,{"$f":"COUNTIF(AS$96:AS$115,\"g\")","v":0},null,null,{"$f":"COUNTIF(AV$96:AV$115,\"g\")","v":0},null,null,{"$f":"COUNTIF(AY$96:AY$115,\"g\")","v":0},null,null,{"$f":"COUNTIF(BB$96:BB$115,\"g\")","v":0},null,null,{"$f":"COUNTIF(BE$96:BE$115,\"g\")","v":0},null,null,{"$f":"COUNTIF(BH$96:BH$115,\"g\")","v":0},null,null,{"$f":"COUNTIF(BK$96:BK$115,\"g\")","v":0}]
[null,"Verlies uit",null,{"$f":"COUNTIF(F$96:F$115,\"w\")","v":0},null,null,{"$f":"COUNTIF(I$96:I$115,\"w\")","v":0},null,null,{"$f":"COUNTIF(L$96:L$115,\"w\")","v":0},null,null,{"$f":"COUNTIF(O$96:O$115,\"w\")","v":0},null,null,{"$f":"COUNTIF(R$96:R$115,\"w\")","v":0},null,null,{"$f":"COUNTIF(U$96:U$115,\"w\")","v":0},null,null,{"$f":"COUNTIF(X$96:X$115,\"w\")","v":0},null,null,{"$f":"COUNTIF(AA$96:AA$115,\"w\")","v":0},null,null,{"$f":"COUNTIF(AD$96:AD$115,\"w\")","v":0},null,null,{"$f":"COUNTIF(AG$96:AG$115,\"w\")","v":0},null,null,{"$f":"COUNTIF(AJ$96:AJ$115,\"w\")","v":0},null,null,{"$f":"COUNTIF(AM$96:AM$115,\"w\")","v":0},null,null,{"$f":"COUNTIF(AP$96:AP$115,\"w\")","v":0},null,null,{"$f":"COUNTIF(AS$96:AS$115,\"w\")","v":0},null,null,{"$f":"COUNTIF(AV$96:AV$115,\"w\")","v":0},null,null,{"$f":"COUNTIF(AY$96:AY$115,\"w\")","v":0},null,null,{"$f":"COUNTIF(BB$96:BB$115,\"w\")","v":0},null,null,{"$f":"COUNTIF(BE$96:BE$115,\"w\")","v":0},null,null,{"$f":"COUNTIF(BH$96:BH$115,\"w\")","v":0},null,null,{"$f":"COUNTIF(BK$96:BK$115,\"w\")","v":0}]
[null,"Vóór uit",null,{"$f":"SUM(E96:E115)","v":0},null,null,{"$f":"SUM(H96:H115)","v":0},null,null,{"$f":"SUM(K96:K115)","v":0},null,null,{"$f":"SUM(N96:N115)","v":0},null,null,{"$f":"SUM(Q96:Q115)","v":0},null,null,{"$f":"SUM(T96:T115)","v":0},null,null,{"$f":"SUM(W96:W115)","v":0},null,null,{"$f":"SUM(Z96:Z115)","v":0},null,null,{"$f":"SUM(AC96:AC115)","v":0},null,null,{"$f":"SUM(AF96:AF115)","v":0},null,null,{"$f":"SUM(AI96:AI115)","v":0},null,null,{"$f":"SUM(AL96:AL115)","v":0},null,null,{"$f":"SUM(AO96:AO115)","v":0},null,null,{"$f":"SUM(AR96:AR115)","v":0},null,null,{"$f":"SUM(AU96:AU115)","v":0},null,null,{"$f":"SUM(AX96:AX115)","v":0},null,null,{"$f":"SUM(BA96:BA115)","v":0},null,null,{"$f":"SUM(BD96:BD115)","v":0},null,null,{"$f":"SUM(BG96:BG115)","v":0},null,null,{"$f":"SUM(BJ96:BJ115)","v":0}]
[null,"Tegen uit",null,{"$f":"SUM(D96:D115)","v":0},null,null,{"$f":"SUM(G96:G115)","v":0},null,null,{"$f":"SUM(J96:J115)","v":0},null,null,{"$f":"SUM(M96:M115)","v":0},null,null,{"$f":"SUM(P96:P115)","v":0},null,null,{"$f":"SUM(S96:S115)","v":0},null,null,{"$f":"SUM(V96:V115)","v":0},null,null,{"$f":"SUM(Y96:Y115)","v":0},null,null,{"$f":"SUM(AB96:AB115)","v":0},null,null,{"$f":"SUM(AE96:AE115)","v":0},null,null,{"$f":"SUM(AH96:AH115)","v":0},null,null,{"$f":"SUM(AK96:AK115)","v":0},null,null,{"$f":"SUM(AN96:AN115)","v":0},null,null,{"$f":"SUM(AQ96:AQ115)","v":0},null,null,{"$f":"SUM(AT96:AT115)","v":0},null,null,{"$f":"SUM(AW96:AW115)","v":0},null,null,{"$f":"SUM(AZ96:AZ115)","v":0},null,null,{"$f":"SUM(BC96:BC115)","v":0},null,null,{"$f":"SUM(BF96:BF115)","v":0},null,null,{"$f":"SUM(BI96:BI115)","v":0}]
[]
[]
[]
[null,"Periode 4",null,{"$f":"$B$126","v":"Almere City FC"},null,null,{"$f":"$B$127","v":"FC Den Bosch"},null,null,{"$f":"$B$128","v":"FC Dordrecht"},null,null,{"$f":"$B$129","v":"FC Eindhoven"},null,null,{"$f":"$B$130","v":"FC Twente"},null,null,{"$f":"$B$131","v":"FC Volendam"},null,null,{"$f":"$B$132","v":"Go Ahead Eagles"},null,null,{"$f":"$B$133","v":"Helmond Sport"},null,null,{"$f":"$B$134","v":"Jong Ajax"},null,null,{"$f":"$B$135","v":"Jong AZ Alkmaar"},null,null,{"$f":"$B$136","v":"Jong FC Utrecht"},null,null,{"$f":"$B$137","v":"Jong PSV"},null,null,{"$f":"$B$138","v":"MVV Maastricht"},null,null,{"$f":"$B$139","v":"NEC Nijmegen"},null,null,{"$f":"$B$140","v":"RKC Waalwijk"},null,null,{"$f":"$B$141","v":"Roda JC Kerkrade"},null,null,{"$f":"$B$142","v":"SC Cambuur"},null,null,{"$f":"$B$143","v":"SC Telstar"},null,null,{"$f":"$B$144","v":"Sparta Rotterdam"},null,null,{"$f":"$B$145","v":"TOP Oss"},null,null,"Winst thuis","Gelijk thuis","Verlies thuis","Vóór thuis","Tegen thuis",null,"Plaats","Team","Gespeeld","Winst","Gelijk","Verlies","Straf","Punten","Doelsaldo","Vóór","Tegen","Code"]
[null,{"$f":"BS126","v":"Almere City FC"},null,null,null,null,{"$f":"IFERROR(IF(ISBLANK(VLOOKUP(TEXT($B126,)&\" - \"&TEXT($G$125,),SchemaKK4,2,0)),\"\",VLOOKUP(TEXT($B126,)&\" - \"&TEXT($G$125,),SchemaKK4,2,0)),\"\")","v":""},{"$f":"IFERROR(IF(ISBLANK(VLOOKUP(TEXT($B126,)&\" - \"&TEXT($G$125,),SchemaKK4,3,0)),\"\",VLOOKUP(TEXT($B126,)&\" - \"&TEXT($G$125,),SchemaKK4,3,0)),\"\")","v":""},{"$f":"IF(H126=\"\",\"\",IF(G126>H126,\"w\",IF(G126=H126,\"g\",\"v\")))","v":""},{"$f":"IFERROR(IF(ISBLANK(VLOOKUP(TEXT($B126,)&\" - \"&TEXT($J$125,),SchemaKK4,2,0)),\"\",VLOOKUP(TEXT($B126,)&\" - \"&TEXT($J$125,),SchemaKK4,2,0)),\"\")","v":""},{"$f":"IFERROR(IF(ISBLANK(VLOOKUP(TEXT($B126,)&\" - \"&TEXT($J$125,),SchemaKK4,3,0)),\"\",VLOOKUP(TEXT($B126,)&\" - \"&TEXT($J$125,),SchemaKK4,3,0)),\"\")","v":""},{"$f":"IF(K126=\"\",\"\",IF(J126>K126,\"w\",IF(J126=K126,\"g\",\"v\")))","v":""},{"$f":"IFERROR(IF(ISBLANK(VLOOKUP(TEXT($B126,)&\" - \"&TEXT($M$125,),SchemaKK4,2,0)),\"\",VLOOKUP(TEXT($B126,)&\" - \"&TEXT($M$125,),SchemaKK4,2,0)),\"\")","v":""},{"$f":"IFERROR(IF(ISBLANK(VLOOKUP(TEXT($B126,)&\" - \"&TEXT($M$125,),SchemaKK4,3,0)),\"\",VLOOKUP(TEXT($B126,)&\" - \"&TEXT($M$125,),SchemaKK4,3,0)),\"\")","v":""},{"$f":"IF(N126=\"\",\"\",IF(M126>N126,\"w\",IF(M126=N126,\"g\",\"v\")))","v":""},{"$f":"IFERROR(IF(ISBLANK(VLOOKUP(TEXT($B126,)&\" - \"&TEXT($P$125,),SchemaKK4,2,0)),\"\",VLOOKUP(TEXT($B126,)&\" - \"&TEXT($P$125,),SchemaKK4,2,0)),\"\")","v":""},{"$f":"IFERROR(IF(ISBLANK(VLOOKUP(TEXT($B126,)&\" - \"&TEXT($P$125,),SchemaKK4,3,0)),\"\",VLOOKUP(TEXT($B126,)&\" - \"&TEXT($P$125,),SchemaKK4,3,0)),\"\")","v":""},{"$f":"IF(Q126=\"\",\"\",IF(P126>Q126,\"w\",IF(P126=Q126,\"g\",\"v\")))","v":""},{"$f":"IFERROR(IF(ISBLANK(VLOOKUP(TEXT($B126,)&\" - \"&TEXT($S$125,),SchemaKK4,2,0)),\"\",VLOOKUP(TEXT($B126,)&\" - \"&TEXT($S$125,),SchemaKK4,2,0)),\"\")","v":""},{"$f":"IFERROR(IF(ISBLANK(VLOOKUP(TEXT($B126,)&\" - \"&TEXT($S$125,),SchemaKK4,3,0)),\"\",VLOOKUP(TEXT($B126,)&\" - \"&TEXT($S$125,),SchemaKK4,3,0)),\"\")","v":""},{"$f":"IF(T126=\"\",\"\",IF(S126>T126,\"w\",IF(S126=T126,\"g\",\"v\")))","v":""},{"$f":"IFERROR(IF(ISBLANK(VLOOKUP(TEXT($B126,)&\" - \"&TEXT($V$125,),SchemaKK4,2,0)),\"\",VLOOKUP(TEXT($B126,)&\" - \"&TEXT($V$125,),SchemaKK4,2,0)),\"\")","v":""},{"$f":"IFERROR(IF(ISBLANK(VLOOKUP(TEXT($B126,)&\" - \"&TEXT($V$125,),SchemaKK4,3,0)),\"\",VLOOKUP(TEXT($B126,)&\" - \"&TEXT($V$125,),SchemaKK4,3,0)),\"\")","v":""},{"$f":"IF(W126=\"\",\"\",IF(V126>W126,\"w\",IF(V126=W126,\"g\",\"v\")))","v":""},{"$f":"IFERROR(IF(ISBLANK(VLOOKUP(TEXT($B126,)&\" - \"&TEXT($Y$125,),SchemaKK4,2,0)),\"\",VLOOKUP(TEXT($B126,)&\" - \"&TEXT($Y$125,),SchemaKK4,2,0)),\"\")","v":""},{"$f":"IFERROR(IF(ISBLANK(VLOOKUP(TEXT($B126,)&\" - \"&TEXT($Y$125,),SchemaKK4,3,0)),\"\",VLOOKUP(TEXT($B126,)&\" - \"&TEXT($Y$125,),SchemaKK4,3,0)),\"\")","v":""},{"$f":"IF(Z126=\"\",\"\",IF(Y126>Z126,\"w\",IF(Y126=Z126,\"g\",\"v\")))","v":""},{"$f":"IFERROR(IF(ISBLANK(VLOOKUP(TEXT($B126,)&\" - \"&TEXT($AB$125,),SchemaKK4,2,0)),\"\",VLOOKUP(TEXT($B126,)&\" - \"&TEXT($AB$125,),SchemaKK4,2,0)),\"\")","v":""},{"$f":"IFERROR(IF(ISBLANK(VLOOKUP(TEXT($B126,)&\" - \"&TEXT($AB$125,),SchemaKK4,3,0)),\"\",VLOOKUP(TEXT($B126,)&\" - \"&TEXT($AB$125,),SchemaKK4,3,0)),\"\")","v":""},{"$f":"IF(AC126=\"\",\"\",IF(AB126>AC126,\"w\",IF(AB126=AC126,\"g\",\"v\")))","v":""},{"$f":"IFERROR(IF(ISBLANK(VLOOKUP(TEXT($B126,)&\" - \"&TEXT($AE$125,),SchemaKK4,2,0)),\"\",VLOOKUP(TEXT($B126,)&\" - \"&TEXT($AE$125,),SchemaKK4,2,0)),\"\")","v":""},{"$f":"IFERROR(IF(ISBLANK(VLOOKUP(TEXT($B126,)&\" - \"&TEXT($AE$125,),SchemaKK4,3,0)),\"\",VLOOKUP(TEXT($B126,)&\" - \"&TEXT($AE$125,),SchemaKK4,3,0)),\"\")","v":""},{"$f":"IF(AF126=\"\",\"\",IF(AE126>AF126,\"w\",IF(AE126=AF126,\"g\",\"v\")))","v":""},{"$f":"IFERROR(IF(ISBLANK(VLOOKUP(TEXT($B126,)&\" - \"&TEXT($AH$125,),SchemaKK4,2,0)),\"\",VLOOKUP(TEXT($B126,)&\" - \"&TEXT($AH$125,),SchemaKK4,2,0)),\"\")","v":""},{"$f":"IFERROR(IF(ISBLANK(VLOOKUP(TEXT($B126,)&\" - \"&TEXT($AH$125,),SchemaKK4,3,0)),\"\",VLOOKUP(TEXT($B126,)&\" - \"&TEXT($AH$125,),SchemaKK4,3,0)),\"\")","v":""},{"$f":"IF(AI126=\"\",\"\",IF(AH126>AI126,\"w\",IF(AH126=AI126,\"g\",\"v\")))","v":""},{"$f":"IFERROR(IF(ISBLANK(VLOOKUP(TEXT($B126,)&\" - \"&TEXT($AK$125,),SchemaKK4,2,0)),\"\",VLOOKUP(TEXT($B126,)&\" - \"&TEXT($AK$125,),SchemaKK4,2,0)),\"\")","v":""},{"$f":"IFERROR(IF(ISBLANK(VLOOKUP(TEXT($B126,)&\" - \"&TEXT($AK$125,),SchemaKK4,3,0)),\"\",VLOOKUP(TEXT($B126,)&\" - \"&TEXT($AK$125,),SchemaKK4,3,0)),\"\")","v":""},{"$f":"IF(AL126=\"\",\"\",IF(AK126>AL126,\"w\",IF(AK126=AL126,\"g\",\"v\")))","v":""},{"$f":"IFERROR(IF(ISBLANK(VLOOKUP(TEXT($B126,)&\" - \"&TEXT($AN$125,),SchemaKK4,2,0)),\"\",VLOOKUP(TEXT($B126,)&\" - \"&TEXT($AN$125,),SchemaKK4,2,0)),\"\")","v":""},{"$f":"IFERROR(IF(ISBLANK(VLOOKUP(TEXT($B126,)&\" - \"&TEXT($AN$125,),SchemaKK4,3,0)),\"\",VLOOKUP(TEXT($B126,)&\" - \"&TEXT($AN$125,),SchemaKK4,3,0)),\"\")","v":""},{"$f":"IF(AO126=\"\",\"\",IF(AN126>AO126,\"w\",IF(AN126=AO126,\"g\",\"v\")))","v":""},{"$f":"IFERROR(IF(ISBLANK(VLOOKUP(TEXT($B126,)&\" - \"&TEXT($AQ$125,),SchemaKK4,2,0)),\"\",VLOOKUP(TEXT($B126,)&\" - \"&TEXT($AQ$125,),SchemaKK4,2,0)),\"\")","v":""},{"$f":"IFERROR(IF(ISBLANK(VLOOKUP(TEXT($B126,)&\" - \"&TEXT($AQ$125,),SchemaKK4,3,0)),\"\",VLOOKUP(TEXT($B126,)&\" - \"&TEXT($AQ$125,),SchemaKK4,3,0)),\"\")","v":""},{"$f":"IF(AR126=\"\",\"\",IF(AQ126>AR126,\"w\",IF(AQ126=AR126,\"g\",\"v\")))","v":""},{"$f":"IFERROR(IF(ISBLANK(VLOOKUP(TEXT($B126,)&\" - \"&TEXT($AT$125,),SchemaKK4,2,0)),\"\",VLOOKUP(TEXT($B126,)&\" - \"&TEXT($AT$125,),SchemaKK4,2,0)),\"\")","v":""},{"$f":"IFERROR(IF(ISBLANK(VLOOKUP(TEXT($B126,)&\" - \"&TEXT($AT$125,),SchemaKK4,3,0)),\"\",VLOOKUP(TEXT($B126,)&\" - \"&TEXT($AT$125,),SchemaKK4,3,0)),\"\")","v":""},{"$f":"IF(AU126=\"\",\"\",IF(AT126>AU126,\"w\",IF(AT126=AU126,\"g\",\"v\")))","v":""},{"$f":"IFERROR(IF(ISBLANK(VLOOKUP(TEXT($B126,)&\" - \"&TEXT($AW$125,),SchemaKK4,2,0)),\"\",VLOOKUP(TEXT($B126,)&\" - \"&TEXT($AW$125,),SchemaKK4,2,0)),\"\")","v":""},{"$f":"IFERROR(IF(ISBLANK(VLOOKUP(TEXT($B126,)&\" - \"&TEXT($AW$125,),SchemaKK4,3,0)),\"\",VLOOKUP(TEXT($B126,)&\" - \"&TEXT($AW$125,),SchemaKK4,3,0)),\"\")","v":""},{"$f":"IF(AX126=\"\",\"\",IF(AW126>AX126,\"w\",IF(AW126=AX126,\"g\",\"v\")))","v":""},{"$f":"IFERROR(IF(ISBLANK(VLOOKUP(TEXT($B126,)&\" - \"&TEXT($AZ$125,),SchemaKK4,2,0)),\"\",VLOOKUP(TEXT($B126,)&\" - \"&TEXT($AZ$125,),SchemaKK4,2,0)),\"\")","v":""},{"$f":"IFERROR(IF(ISBLANK(VLOOKUP(TEXT($B126,)&\" - \"&TEXT($AZ$125,),SchemaKK4,3,0)),\"\",VLOOKUP(TEXT($B126,)&\" - \"&TEXT($AZ$125,),SchemaKK4,3,0)),\"\")","v":""},{"$f":"IF(BA126=\"\",\"\",IF(AZ126>BA126,\"w\",IF(AZ126=BA126,\"g\",\"v\")))","v":""},{"$f":"IFERROR(IF(ISBLANK(VLOOKUP(TEXT($B126,)&\" - \"&TEXT($BC$125,),SchemaKK4,2,0)),\"\",VLOOKUP(TEXT($B126,)&\" - \"&TEXT($BC$125,),SchemaKK4,2,0)),\"\")","v":""},{"$f":"IFERROR(IF(ISBLANK(VLOOKUP(TEXT($B126,)&\" - \"&TEXT($BC$125,),SchemaKK4,3,0)),\"\",VLOOKUP(TEXT($B126,)&\" - \"&TEXT($BC$125,),SchemaKK4,3,0)),\"\")","v":""},{"$f":"IF(BD126=\"\",\"\",IF(BC126>BD126,\"w\",IF(BC126=BD126,\"g\",\"v\")))","v":""},{"$f":"IFERROR(IF(ISBLANK(VLOOKUP(TEXT($B126,)&\" - \"&TEXT($BF$125,),SchemaKK4,2,0)),\"\",VLOOKUP(TEXT($B126,)&\" - \"&TEXT($BF$125,),SchemaKK4,2,0)),\"\")","v":""},{"$f":"IFERROR(IF(ISBLANK(VLOOKUP(TEXT($B126,)&\" - \"&TEXT($BF$125,),SchemaKK4,3,0)),\"\",VLOOKUP(TEXT($B126,)&\" - \"&TEXT($BF$125,),SchemaKK4,3,0)),\"\")","v":""},{"$f":"IF(BG126=\"\",\"\",IF(BF126>BG126,\"w\",IF(BF126=BG126,\"g\",\"v\")))","v":""},{"$f":"IFERROR(IF(ISBLANK(VLOOKUP(TEXT($B126,)&\" - \"&TEXT($BI$125,),SchemaKK4,2,0)),\"\",VLOOKUP(TEXT($B126,)&\" - \"&TEXT($BI$125,),SchemaKK4,2,0)),\"\")","v":""},{"$f":"IFERROR(IF(ISBLANK(VLOOKUP(TEXT($B126,)&\" - \"&TEXT($BI$125,),SchemaKK4,3,0)),\"\",VLOOKUP(TEXT($B126,)&\" - \"&TEXT($BI$125,),SchemaKK4,3,0)),\"\")","v":""},{"$f":"IF(BJ126=\"\",\"\",IF(BI126>BJ126,\"w\",IF(BI126=BJ126,\"g\",\"v\")))","v":""},{"$f":"COUNTIF(F126:BK126,\"w\")","v":0},{"$f":"COUNTIF(F126:BK126,\"g\")","v":0},{"$f":"COUNTIF(F126:BK126,\"v\")","v":0},{"$f":"SUM(D126,G126,J126,M126,P126,S126,V126,Y126,AB126,AE126,AH126,AK126,AN126,AQ126,AT126,AW126,AZ126,BC126,BF126,BI126)","v":0},{"$f":"SUM(E126,H126,K126,N126,Q126,T126,W126,Z126,AC126,AF126,AI126,AL126,AO126,AR126,AU126,AX126,BA126,BD126,BG126,BJ126)","v":0},null,{"$f":"RANK(CC126,$CC$126:$CC$145)","v":1},"Almere City FC",{"$f":"SUM(BU126:BW126)","v":0},{"$f":"INDEX($BL$126:$BL$145,MATCH(BS126,$B$126:$B$145,0))+INDEX($D$147:$BJ$147,MATCH(BS126,$D$125:$BJ$125,0))","v":0},{"$f":"INDEX($BM$126:$BM$145,MATCH(BS126,$B$126:$B$145,0))+INDEX($D$148:$BJ$148,MATCH(BS126,$D$125:$BJ$125,0))","v":0},{"$f":"INDEX($BN$126:$BN$145,MATCH(BS126,$B$126:$B$145,0))+INDEX($D$149:$BJ$149,MATCH(BS126,$D$125:$BJ$125,0))","v":0},null,{"$f":"(BU126*3)+BV126+BX126","v":0},{"$f":"CA126-CB126","v":0},{"$f":"INDEX($BO$126:$BO$145,MATCH(BS126,$B$126:$B$145,0))+INDEX($D$150:$BJ$150,MATCH(BS126,$D$125:$BJ$125,0))","v":0},{"$f":"INDEX($BP$126:$BP$145,MATCH(BS126,$B$126:$B$145,0))+INDEX($D$151:$BJ$151,MATCH(BS126,$D$125:$BJ$125,0))","v":0},{"$f":"VALUE(TEXT(BY126,\"000\")&TEXT(100+BZ126,\"000\")&TEXT(CA126,\"000\")&TEXT(100-BT126,\"00\")&TEXT(COUNTIF($BS$126:$BS$145,\">=\"&BS126),\"00\"))","v":10000010020}]
[null,{"$f":"BS127","v":"FC Den Bosch"},null,{"$f":"IFERROR(IF(ISBLANK(VLOOKUP(TEXT($B127,)&\" - \"&TEXT($D$125,),SchemaKK4,2,0)),\"\",VLOOKUP(TEXT($B127,)&\" - \"&TEXT($D$125,),SchemaKK4,2,0)),\"\")","v":""},{"$f":"IFERROR(IF(ISBLANK(VLOOKUP(TEXT($B127,)&\" - \"&TEXT($D$125,),SchemaKK4,3,0)),\"\",VLOOKUP(TEXT($B127,)&\" - \"&TEXT($D$125,),SchemaKK4,3,0)),\"\")","v":""},{"$f":"IF(E127=\"\",\"\",IF(D127>E127,\"w\",IF(D127=E127,\"g\",\"v\")))","v":""},null,null,null,{"$f":"IFERROR(IF(ISBLANK(VLOOKUP(TEXT($B127,)&\" - \"&TEXT($J$125,),SchemaKK4,2,0)),\"\",VLOOKUP(TEXT($B127,)&\" - \"&TEXT($J$125,),SchemaKK4,2,0)),\"\")","v":""},{"$f":"IFERROR(IF(ISBLANK(VLOOKUP(TEXT($B127,)&\" - \"&TEXT($J$125,),SchemaKK4,3,0)),\"\",VLOOKUP(TEXT($B127,)&\" - \"&TEXT($J$125,),SchemaKK4,3,0)),\"\")","v":""},"",{"$f":"IFERROR(IF(ISBLANK(VLOOKUP(TEXT($B127,)&\" - \"&TEXT($M$125,),SchemaKK4,2,0)),\"\",VLOOKUP(TEXT($B127,)&\" - \"&TEXT($M$125,),SchemaKK4,2,0)),\"\")","v":""},{"$f":"IFERROR(IF(ISBLANK(VLOOKUP(TEXT($B127,)&\" - \"&TEXT($M$125,),SchemaKK4,3,0)),\"\",VLOOKUP(TEXT($B127,)&\" - \"&TEXT($M$125,),SchemaKK4,3,0)),\"\")","v":""},"",{"$f":"IFERROR(IF(ISBLANK(VLOOKUP(TEXT($B127,)&\" - \"&TEXT($P$125,),SchemaKK4,2,0)),\"\",VLOOKUP(TEXT($B127,)&\" - \"&TEXT($P$125,),SchemaKK4,2,0)),\"\")","v":""},{"$f":"IFERROR(IF(ISBLANK(VLOOKUP(TEXT($B127,)&\" - \"&TEXT($P$125,),SchemaKK4,3,0)),\"\",VLOOKUP(TEXT($B127,)&\" - \"&TEXT($P$125,),SchemaKK4,3,0)),\"\")","v":""},"",{"$f":"IFERROR(IF(ISBLANK(VLOOKUP(TEXT($B127,)&\" - \"&TEXT($S$125,),SchemaKK4,2,0)),\"\",VLOOKUP(TEXT($B127,)&\" - \"&TEXT($S$125,),SchemaKK4,2,0)),\"\")","v":""},{"$f":"IFERROR(IF(ISBLANK(VLOOKUP(TEXT($B127,)&\" - \"&TEXT($S$125,),SchemaKK4,3,0)),\"\",VLOOKUP(TEXT($B127,)&\" - \"&TEXT($S$125,),SchemaKK4,3,0)),\"\")","v":""},"","","","","","","","","","","","","","","","","","","","","","","","","","","","","","","","","","","","","","","","","","","",0,0,0,0,0,null,2,"FC Den Bosch",0,0,0,0,null,0,0,0,0,10000010019]
[null,"FC Dordrecht",null,"","","",{"$f":"IFERROR(IF(ISBLANK(VLOOKUP(TEXT($B128,)&\" - \"&TEXT($G$125,),SchemaKK4,2,0)),\"\",VLOOKUP(TEXT($B128,)&\" - \"&TEXT($G$125,),SchemaKK4,2,0)),\"\")","v":""},{"$f":"IFERROR(IF(ISBLANK(VLOOKUP(TEXT($B128,)&\" - \"&TEXT($G$125,),SchemaKK4,3,0)),\"\",VLOOKUP(TEXT($B128,)&\" - \"&TEXT($G$125,),SchemaKK4,3,0)),\"\")","v":""},"",null,null,null,{"$f":"IFERROR(IF(ISBLANK(VLOOKUP(TEXT($B128,)&\" - \"&TEXT($M$125,),SchemaKK4,2,0)),\"\",VLOOKUP(TEXT($B128,)&\" - \"&TEXT($M$125,),SchemaKK4,2,0)),\"\")","v":""},{"$f":"IFERROR(IF(ISBLANK(VLOOKUP(TEXT($B128,)&\" - \"&TEXT($M$125,),SchemaKK4,3,0)),\"\",VLOOKUP(TEXT($B128,)&\" - \"&TEXT($M$125,),SchemaKK4,3,0)),\"\")","v":""},"",{"$f":"IFERROR(IF(ISBLANK(VLOOKUP(TEXT($B128,)&\" - \"&TEXT($P$125,),SchemaKK4,2,0)),\"\",VLOOKUP(TEXT($B128,)&\" - \"&TEXT($P$125,),SchemaKK4,2,0)),\"\")","v":""},{"$f":"IFERROR(IF(ISBLANK(VLOOKUP(TEXT($B128,)&\" - \"&TEXT($P$125,),SchemaKK4,3,0)),\"\",VLOOKUP(TEXT($B128,)&\" - \"&TEXT($P$125,),SchemaKK4,3,0)),\"\")","v":""},"",{"$f":"IFERROR(IF(ISBLANK(VLOOKUP(TEXT($B128,)&\" - \"&TEXT($S$125,),SchemaKK4,2,0)),\"\",VLOOKUP(TEXT($B128,)&\" - \"&TEXT($S$125,),SchemaKK4,2,0)),\"\")","v":""},{"$f":"IFERROR(IF(ISBLANK(VLOOKUP(TEXT($B128,)&\" - \"&TEXT($S$125,),SchemaKK4,3,0)),\"\",VLOOKUP(TEXT($B128,)&\" - \"&TEXT($S$125,),SchemaKK4,3,0)),\"\")","v":""},"","","","","","","","","","","","","","","","","","","","","","","","","","","","","","","","","","","","","","","","","","","",0,0,0,0,0,null,3,"FC Dordrecht",0,0,0,0,null,0,0,0,0,10000010018]
[null,"FC Eindhoven",null,"","","","","","",{"$f":"IFERROR(IF(ISBLANK(VLOOKUP(TEXT($B129,)&\" - \"&TEXT($J$125,),SchemaKK4,2,0)),\"\",VLOOKUP(TEXT($B129,)&\" - \"&TEXT($J$125,),SchemaKK4,2,0)),\"\")","v":""},{"$f":"IFERROR(IF(ISBLANK(VLOOKUP(TEXT($B129,)&\" - \"&TEXT($J$125,),SchemaKK4,3,0)),\"\",VLOOKUP(TEXT($B129,)&\" - \"&TEXT($J$125,),SchemaKK4,3,0)),\"\")","v":""},"",null,null,null,{"$f":"IFERROR(IF(ISBLANK(VLOOKUP(TEXT($B129,)&\" - \"&TEXT($P$125,),SchemaKK4,2,0)),\"\",VLOOKUP(TEXT($B129,)&\" - \"&TEXT($P$125,),SchemaKK4,2,0)),\"\")","v":""},{"$f":"IFERROR(IF(ISBLANK(VLOOKUP(TEXT($B129,)&\" - \"&TEXT($P$125,),SchemaKK4,3,0)),\"\",VLOOKUP(TEXT($B129,)&\" - \"&TEXT($P$125,),SchemaKK4,3,0)),\"\")","v":""},"",{"$f":"IFERROR(IF(ISBLANK(VLOOKUP(TEXT($B129,)&\" - \"&TEXT($S$125,),SchemaKK4,2,0)),\"\",VLOOKUP(TEXT($B129,)&\" - \"&TEXT($S$125,),SchemaKK4,2,0)),\"\")","v":""},{"$f":"IFERROR(IF(ISBLANK(VLOOKUP(TEXT($B129,)&\" - \"&TEXT($S$125,),SchemaKK4,3,0)),\"\",VLOOKUP(TEXT($B129,)&\" - \"&TEXT($S$125,),SchemaKK4,3,0)),\"\")","v":""},"","","","","","","","","","","","","","","","","","","","","","","","","","","","","","","","","","","","","","","","","","","",0,0,0,0,0,null,4,"FC Eindhoven",0,0,0,0,null,0,0,0,0,10000010017]
[null,"FC Twente",null,"","","","","","","","","",{"$f":"IFERROR(IF(ISBLANK(VLOOKUP(TEXT($B130,)&\" - \"&TEXT($M$125,),SchemaKK4,2,0)),\"\",VLOOKUP(TEXT($B130,)&\" - \"&TEXT($M$125,),SchemaKK4,2,0)),\"\")","v":""},{"$f":"IFERROR(IF(ISBLANK(VLOOKUP(TEXT($B130,)&\" - \"&TEXT($M$125,),SchemaKK4,3,0)),\"\",VLOOKUP(TEXT($B130,)&\" - \"&TEXT($M$125,),SchemaKK4,3,0)),\"\")","v":""},"",null,null,null,{"$f":"IFERROR(IF(ISBLANK(VLOOKUP(TEXT($B130,)&\" - \"&TEXT($S$125,),SchemaKK4,2,0)),\"\",VLOOKUP(TEXT($B130,)&\" - \"&TEXT($S$125,),SchemaKK4,2,0)),\"\")","v":""},{"$f":"IFERROR(IF(ISBLANK(VLOOKUP(TEXT($B130,)&\" - \"&TEXT($S$125,),SchemaKK4,3,0)),\"\",VLOOKUP(TEXT($B130,)&\" - \"&TEXT($S$125,),SchemaKK4,3,0)),\"\")","v":""},"","","","","","","","","","","","","","","","","","","","","","","","","","","","","","","","","","","","","","","","","","","",0,0,0,0,0,null,5,"FC Twente",0,0,0,0,null,0,0,0,0,10000010016]
[null,"FC Volendam",null,"","","","","","","","","","","","",{"$f":"IFERROR(IF(ISBLANK(VLOOKUP(TEXT($B131,)&\" - \"&TEXT($P$125,),SchemaKK4,2,0)),\"\",VLOOKUP(TEXT($B131,)&\" - \"&TEXT($P$125,),SchemaKK4,2,0)),\"\")","v":""},{"$f":"IFERROR(IF(ISBLANK(VLOOKUP(TEXT($B131,)&\" - \"&TEXT($P$125,),SchemaKK4,3,0)),\"\",VLOOKUP(TEXT($B131,)&\" - \"&TEXT($P$125,),SchemaKK4,3,0)),\"\")","v":""},"",null,null,null,"","","","","","","","","","","","","","","","","","","","","","","","","","","","","","","","","","","","","","","","","","",0,0,0,0,0,null,6,"FC Volendam",0,0,0,0,null,0,0,0,0,10000010015]
[null,"Go Ahead Eagles",null,"","","","","","","","","","","","","","","",{"$f":"IFERROR(IF(ISBLANK(VLOOKUP(TEXT($B132,)&\" - \"&TEXT($S$125,),SchemaKK4,2,0)),\"\",VLOOKUP(TEXT($B132,)&\" - \"&TEXT($S$125,),SchemaKK4,2,0)),\"\")","v":""},{"$f":"IFERROR(IF(ISBLANK(VLOOKUP(TEXT($B132,)&\" - \"&TEXT($S$125,),SchemaKK4,3,0)),\"\",VLOOKUP(TEXT($B132,)&\" - \"&TEXT($S$125,),SchemaKK4,3,0)),\"\")","v":""},"",null,null,null,"","","","","","","","","","","","","","","","","","","","","","","","","","","","","","","","","","","","","","","",0,0,0,0,0,null,7,"Go Ahead Eagles",0,0,0,0,null,0,0,0,0,10000010014]
[null,"Helmond Sport",null,"","","","","","","","","","","","","","","","","","",{"$f":"IFERROR(IF(ISBLANK(VLOOKUP(TEXT($B133,)&\" - \"&TEXT($V$125,),SchemaKK4,2,0)),\"\",VLOOKUP(TEXT($B133,)&\" - \"&TEXT($V$125,),SchemaKK4,2,0)),\"\")","v":""},{"$f":"IFERROR(IF(ISBLANK(VLOOKUP(TEXT($B133,)&\" - \"&TEXT($V$125,),SchemaKK4,3,0)),\"\",VLOOKUP(TEXT($B133,)&\" - \"&TEXT($V$125,),SchemaKK4,3,0)),\"\")","v":""},"",null,null,null,"","","","","","","","","","","","","","","","","","","","","","","","","","","","","","","","","","","","",0,0,0,0,0,null,8,"Helmond Sport",0,0,0,0,null,0,0,0,0,10000010013]
[null,"Jong Ajax",null,"","","","","","","","","","","","","","","","","","","","","",{"$f":"IFERROR(IF(ISBLANK(VLOOKUP(TEXT($B134,)&\" - \"&TEXT($Y$125,),SchemaKK4,2,0)),\"\",VLOOKUP(TEXT($B134,)&\" - \"&TEXT($Y$125,),SchemaKK4,2,0)),\"\")","v":""},{"$f":"IFERROR(IF(ISBLANK(VLOOKUP(TEXT($B134,)&\" - \"&TEXT($Y$125,),SchemaKK4,3,0)),\"\",VLOOKUP(TEXT($B134,)&\" - \"&TEXT($Y$125,),SchemaKK4,3,0)),\"\")","v":""},"",null,null,null,"","","","","","","","","","","","","","","","","","","","","","","","","","","","","","","","","",0,0,0,0,0,null,9,"Jong Ajax",0,0,0,0,null,0,0,0,0,10000010012]
[null,"Jong AZ Alkmaar",null,"","","","","","","","","","","","","","","","","","","","","","","","",{"$f":"IFERROR(IF(ISBLANK(VLOOKUP(TEXT($B135,)&\" - \"&TEXT($AB$125,),SchemaKK4,2,0)),\"\",VLOOKUP(TEXT($B135,)&\" - \"&TEXT($AB$125,),SchemaKK4,2,0)),\"\")","v":""},{"$f":"IFERROR(IF(ISBLANK(VLOOKUP(TEXT($B135,)&\" - \"&TEXT($AB$125,),SchemaKK4,3,0)),\"\",VLOOKUP(TEXT($B135,)&\" - \"&TEXT($AB$125,),SchemaKK4,3,0)),\"\")","v":""},"",null,null,null,"","","","","","","","","","","","","","","","","","","","","","","","","","","","","","",0,0,0,0,0,null,10,"Jong AZ Alkmaar",0,0,0,0,null,0,0,0,0,10000010011]
[null,"Jong FC Utrecht",null,"","","","","","","","","","","","","","","","","","","","","","","","","","","",{"$f":"IFERROR(IF(ISBLANK(VLOOKUP(TEXT($B136,)&\" - \"&TEXT($AE$125,),SchemaKK4,2,0)),\"\",VLOOKUP(TEXT($B136,)&\" - \"&TEXT($AE$125,),SchemaKK4,2,0)),\"\")","v":""},{"$f":"IFERROR(IF(ISBLANK(VLOOKUP(TEXT($B136,)&\" - \"&TEXT($AE$125,),SchemaKK4,3,0)),\"\",VLOOKUP(TEXT($B136,)&\" - \"&TEXT($AE$125,),SchemaKK4,3,0)),\"\")","v":""},"",null,null,null,"","","","","","","","","","","","","","","","","","","","","","","","","","","",0,0,0,0,0,null,11,"Jong FC Utrecht",0,0,0,0,null,0,0,0,0,10000010010]
[null,"Jong PSV",null,"","","","","","","","","","","","","","","","","","","","","","","","","","","","","","",{"$f":"IFERROR(IF(ISBLANK(VLOOKUP(TEXT($B137,)&\" - \"&TEXT($AH$125,),SchemaKK4,2,0)),\"\",VLOOKUP(TEXT($B137,)&\" - \"&TEXT($AH$125,),SchemaKK4,2,0)),\"\")","v":""},{"$f":"IFERROR(IF(ISBLANK(VLOOKUP(TEXT($B137,)&\" - \"&TEXT($AH$125,),SchemaKK4,3,0)),\"\",VLOOKUP(TEXT($B137,)&\" - \"&TEXT($AH$125,),SchemaKK4,3,0)),\"\")","v":""},"",null,null,null,"","","","","","","","","","","","","","","","","","","","","","","","",0,0,0,0,0,null,12,"Jong PSV",0,0,0,0,null,0,0,0,0,10000010009]
[null,"MVV Maastricht",null,"","","","","","","","","","","","","","","","","","","","","","","","","","","","","","","","","",{"$f":"IFERROR(IF(ISBLANK(VLOOKUP(TEXT($B138,)&\" - \"&TEXT($AK$125,),SchemaKK4,2,0)),\"\",VLOOKUP(TEXT($B138,)&\" - \"&TEXT($AK$125,),SchemaKK4,2,0)),\"\")","v":""},{"$f":"IFERROR(IF(ISBLANK(VLOOKUP(TEXT($B138,)&\" - \"&TEXT($AK$125,),SchemaKK4,3,0)),\"\",VLOOKUP(TEXT($B138,)&\" - \"&TEXT($AK$125,),SchemaKK4,3,0)),\"\")","v":""},"",null,null,null,"","","","","","","","","","","","","","","","","","","","","",0,0,0,0,0,null,13,"MVV Maastricht",0,0,0,0,null,0,0,0,0,10000010008]
[null,"NEC Nijmegen",null,"","","","","","","","","","","","","","","","","","","","","","","","","","","","","","","","","","","","",{"$f":"IFERROR(IF(ISBLANK(VLOOKUP(TEXT($B139,)&\" - \"&TEXT($AN$125,),SchemaKK4,2,0)),\"\",VLOOKUP(TEXT($B139,)&\" - \"&TEXT($AN$125,),SchemaKK4,2,0)),\"\")","v":""},{"$f":"IFERROR(IF(ISBLANK(VLOOKUP(TEXT($B139,)&\" - \"&TEXT($AN$125,),SchemaKK4,3,0)),\"\",VLOOKUP(TEXT($B139,)&\" - \"&TEXT($AN$125,),SchemaKK4,3,0)),\"\")","v":""},"",null,null,null,"","","","","","","","","","","","","","","","","","",0,0,0,0,0,null,14,"NEC Nijmegen",0,0,0,0,null,0,0,0,0,10000010007]
[null,"RKC Waalwijk",null,"","","","","","","","","","","","","","","","","","","","","","","","","","","","","","","","","","","","","","","",{"$f":"IFERROR(IF(ISBLANK(VLOOKUP(TEXT($B140,)&\" - \"&TEXT($AQ$125,),SchemaKK4,2,0)),\"\",VLOOKUP(TEXT($B140,)&\" - \"&TEXT($AQ$125,),SchemaKK4,2,0)),\"\")","v":""},{"$f":"IFERROR(IF(ISBLANK(VLOOKUP(TEXT($B140,)&\" - \"&TEXT($AQ$125,),SchemaKK4,3,0)),\"\",VLOOKUP(TEXT($B140,)&\" - \"&TEXT($AQ$125,),SchemaKK4,3,0)),\"\")","v":""},"",null,null,null,"","","","","","","","","","","","","","","",0,0,0,0,0,null,15,"RKC Waalwijk",0,0,0,0,null,0,0,0,0,10000010006]
[null,"Roda JC Kerkrade",null,"","","","","","","","","","","","","","","","","","","","","","","","","","","","","","","","","","","","","","","","","","",{"$f":"IFERROR(IF(ISBLANK(VLOOKUP(TEXT($B141,)&\" - \"&TEXT($AT$125,),SchemaKK4,2,0)),\"\",VLOOKUP(TEXT($B141,)&\" - \"&TEXT($AT$125,),SchemaKK4,2,0)),\"\")","v":""},{"$f":"IFERROR(IF(ISBLANK(VLOOKUP(TEXT($B141,)&\" - \"&TEXT($AT$125,),SchemaKK4,3,0)),\"\",VLOOKUP(TEXT($B141,)&\" - \"&TEXT($AT$125,),SchemaKK4,3,0)),\"\")","v":""},"",null,null,null,"","","","","","","","","","","","",0,0,0,0,0,null,16,"Roda JC Kerkrade",0,0,0,0,null,0,0,0,0,10000010005]
[null,"SC Cambuur",null,"","","","","","","","","","","","","","","","","","","","","","","","","","","","","","","","","","","","","","","","","","",{"$f":"IFERROR(IF(ISBLANK(VLOOKUP(TEXT($B142,)&\" - \"&TEXT($AT$125,),SchemaKK4,2,0)),\"\",VLOOKUP(TEXT($B142,)&\" - \"&TEXT($AT$125,),SchemaKK4,2,0)),\"\")","v":""},{"$f":"IFERROR(IF(ISBLANK(VLOOKUP(TEXT($B142,)&\" - \"&TEXT($AT$125,),SchemaKK4,3,0)),\"\",VLOOKUP(TEXT($B142,)&\" - \"&TEXT($AT$125,),SchemaKK4,3,0)),\"\")","v":""},"",{"$f":"IFERROR(IF(ISBLANK(VLOOKUP(TEXT($B142,)&\" - \"&TEXT($AW$125,),SchemaKK4,2,0)),\"\",VLOOKUP(TEXT($B142,)&\" - \"&TEXT($AW$125,),SchemaKK4,2,0)),\"\")","v":""},{"$f":"IFERROR(IF(ISBLANK(VLOOKUP(TEXT($B142,)&\" - \"&TEXT($AW$125,),SchemaKK4,3,0)),\"\",VLOOKUP(TEXT($B142,)&\" - \"&TEXT($AW$125,),SchemaKK4,3,0)),\"\")","v":""},"",null,null,null,"","","","","","","","","",0,0,0,0,0,null,17,"SC Cambuur",0,0,0,0,null,0,0,0,0,10000010004]
[null,"SC Telstar",null,"","","","","","","","","","","","","","","","","","","","","","","","","","","","","","","","","","","","","","","","","","",{"$f":"IFERROR(IF(ISBLANK(VLOOKUP(TEXT($B143,)&\" - \"&TEXT($AT$125,),SchemaKK4,2,0)),\"\",VLOOKUP(TEXT($B143,)&\" - \"&TEXT($AT$125,),SchemaKK4,2,0)),\"\")","v":""},{"$f":"IFERROR(IF(ISBLANK(VLOOKUP(TEXT($B143,)&\" - \"&TEXT($AT$125,),SchemaKK4,3,0)),\"\",VLOOKUP(TEXT($B143,)&\" - \"&TEXT($AT$125,),SchemaKK4,3,0)),\"\")","v":""},"",{"$f":"IFERROR(IF(ISBLANK(VLOOKUP(TEXT($B143,)&\" - \"&TEXT($AW$125,),SchemaKK4,2,0)),\"\",VLOOKUP(TEXT($B143,)&\" - \"&TEXT($AW$125,),SchemaKK4,2,0)),\"\")","v":""},{"$f":"IFERROR(IF(ISBLANK(VLOOKUP(TEXT($B143,)&\" - \"&TEXT($AW$125,),SchemaKK4,3,0)),\"\",VLOOKUP(TEXT($B143,)&\" - \"&TEXT($AW$125,),SchemaKK4,3,0)),\"\")","v":""},"",{"$f":"IFERROR(IF(ISBLANK(VLOOKUP(TEXT($B143,)&\" - \"&TEXT($AZ$125,),SchemaKK4,2,0)),\"\",VLOOKUP(TEXT($B143,)&\" - \"&TEXT($AZ$125,),SchemaKK4,2,0)),\"\")","v":""},{"$f":"IFERROR(IF(ISBLANK(VLOOKUP(TEXT($B143,)&\" - \"&TEXT($AZ$125,),SchemaKK4,3,0)),\"\",VLOOKUP(TEXT($B143,)&\" - \"&TEXT($AZ$125,),SchemaKK4,3,0)),\"\")","v":""},"",null,null,null,"","","","","","",0,0,0,0,0,null,18,"SC Telstar",0,0,0,0,null,0,0,0,0,10000010003]
[null,"Sparta Rotterdam",null,"","","","","","","","","","","","","","","","","","","","","","","","","","","","","","","","","","","","","","","","","","",{"$f":"IFERROR(IF(ISBLANK(VLOOKUP(TEXT($B144,)&\" - \"&TEXT($AT$125,),SchemaKK4,2,0)),\"\",VLOOKUP(TEXT($B144,)&\" - \"&TEXT($AT$125,),SchemaKK4,2,0)),\"\")","v":""},{"$f":"IFERROR(IF(ISBLANK(VLOOKUP(TEXT($B144,)&\" - \"&TEXT($AT$125,),SchemaKK4,3,0)),\"\",VLOOKUP(TEXT($B144,)&\" - \"&TEXT($AT$125,),SchemaKK4,3,0)),\"\")","v":""},"",{"$f":"IFERROR(IF(ISBLANK(VLOOKUP(TEXT($B144,)&\" - \"&TEXT($AW$125,),SchemaKK4,2,0)),\"\",VLOOKUP(TEXT($B144,)&\" - \"&TEXT($AW$125,),SchemaKK4,2,0)),\"\")","v":""},{"$f":"IFERROR(IF(ISBLANK(VLOOKUP(TEXT($B144,)&\" - \"&TEXT($AW$125,),SchemaKK4,3,0)),\"\",VLOOKUP(TEXT($B144,)&\" - \"&TEXT($AW$125,),SchemaKK4,3,0)),\"\")","v":""},"",{"$f":"IFERROR(IF(ISBLANK(VLOOKUP(TEXT($B144,)&\" - \"&TEXT($AZ$125,),SchemaKK4,2,0)),\"\",VLOOKUP(TEXT($B144,)&\" - \"&TEXT($AZ$125,),SchemaKK4,2,0)),\"\")","v":""},{"$f":"IFERROR(IF(ISBLANK(VLOOKUP(TEXT($B144,)&\" - \"&TEXT($AZ$125,),SchemaKK4,3,0)),\"\",VLOOKUP(TEXT($B144,)&\" - \"&TEXT($AZ$125,),SchemaKK4,3,0)),\"\")","v":""},"",{"$f":"IFERROR(IF(ISBLANK(VLOOKUP(TEXT($B144,)&\" - \"&TEXT($BC$125,),SchemaKK4,2,0)),\"\",VLOOKUP(TEXT($B144,)&\" - \"&TEXT($BC$125,),SchemaKK4,2,0)),\"\")","v":""},{"$f":"IFERROR(IF(ISBLANK(VLOOKUP(TEXT($B144,)&\" - \"&TEXT($BC$125,),SchemaKK4,3,0)),\"\",VLOOKUP(TEXT($B144,)&\" - \"&TEXT($BC$125,),SchemaKK4,3,0)),\"\")","v":""},"",null,null,null,"","","",0,0,0,0,0,null,19,"Sparta Rotterdam",0,0,0,0,null,0,0,0,0,10000010002]
[null,"TOP Oss",null,"","","","","","","","","","","","","","","","","","","","","","","","","","","","","","","","","","","","","","","","","","",{"$f":"IFERROR(IF(ISBLANK(VLOOKUP(TEXT($B145,)&\" - \"&TEXT($AT$125,),SchemaKK4,2,0)),\"\",VLOOKUP(TEXT($B145,)&\" - \"&TEXT($AT$125,),SchemaKK4,2,0)),\"\")","v":""},{"$f":"IFERROR(IF(ISBLANK(VLOOKUP(TEXT($B145,)&\" - \"&TEXT($AT$125,),SchemaKK4,3,0)),\"\",VLOOKUP(TEXT($B145,)&\" - \"&TEXT($AT$125,),SchemaKK4,3,0)),\"\")","v":""},"",{"$f":"IFERROR(IF(ISBLANK(VLOOKUP(TEXT($B145,)&\" - \"&TEXT($AW$125,),SchemaKK4,2,0)),\"\",VLOOKUP(TEXT($B145,)&\" - \"&TEXT($AW$125,),SchemaKK4,2,0)),\"\")","v":""},{"$f":"IFERROR(IF(ISBLANK(VLOOKUP(TEXT($B145,)&\" - \"&TEXT($AW$125,),SchemaKK4,3,0)),\"\",VLOOKUP(TEXT($B145,)&\" - \"&TEXT($AW$125,),SchemaKK4,3,0)),\"\")","v":""},"",{"$f":"IFERROR(IF(ISBLANK(VLOOKUP(TEXT($B145,)&\" - \"&TEXT($AZ$125,),SchemaKK4,2,0)),\"\",VLOOKUP(TEXT($B145,)&\" - \"&TEXT($AZ$125,),SchemaKK4,2,0)),\"\")","v":""},{"$f":"IFERROR(IF(ISBLANK(VLOOKUP(TEXT($B145,)&\" - \"&TEXT($AZ$125,),SchemaKK4,3,0)),\"\",VLOOKUP(TEXT($B145,)&\" - \"&TEXT($AZ$125,),SchemaKK4,3,0)),\"\")","v":""},"",{"$f":"IFERROR(IF(ISBLANK(VLOOKUP(TEXT($B145,)&\" - \"&TEXT($BC$125,),SchemaKK4,2,0)),\"\",VLOOKUP(TEXT($B145,)&\" - \"&TEXT($BC$125,),SchemaKK4,2,0)),\"\")","v":""},{"$f":"IFERROR(IF(ISBLANK(VLOOKUP(TEXT($B145,)&\" - \"&TEXT($BC$125,),SchemaKK4,3,0)),\"\",VLOOKUP(TEXT($B145,)&\" - \"&TEXT($BC$125,),SchemaKK4,3,0)),\"\")","v":""},"",{"$f":"IFERROR(IF(ISBLANK(VLOOKUP(TEXT($B145,)&\" - \"&TEXT($BF$125,),SchemaKK4,2,0)),\"\",VLOOKUP(TEXT($B145,)&\" - \"&TEXT($BF$125,),SchemaKK4,2,0)),\"\")","v":""},{"$f":"IFERROR(IF(ISBLANK(VLOOKUP(TEXT($B145,)&\" - \"&TEXT($BF$125,),SchemaKK4,3,0)),\"\",VLOOKUP(TEXT($B145,)&\" - \"&TEXT($BF$125,),SchemaKK4,3,0)),\"\")","v":""},"",null,null,null,0,0,0,0,0,null,20,"TOP Oss",0,0,0,0,null,0,0,0,0,10000010001]
[]
[null,"Winst uit",null,{"$f":"COUNTIF(F$126:F$145,\"v\")","v":0},null,null,{"$f":"COUNTIF(I$126:I$145,\"v\")","v":0},null,null,{"$f":"COUNTIF(L$126:L$145,\"v\")","v":0},null,null,{"$f":"COUNTIF(O$126:O$145,\"v\")","v":0},null,null,{"$f":"COUNTIF(R$126:R$145,\"v\")","v":0},null,null,{"$f":"COUNTIF(U$126:U$145,\"v\")","v":0},null,null,{"$f":"COUNTIF(X$126:X$145,\"v\")","v":0},null,null,{"$f":"COUNTIF(AA$126:AA$145,\"v\")","v":0},null,null,{"$f":"COUNTIF(AD$126:AD$145,\"v\")","v":0},null,null,{"$f":"COUNTIF(AG$126:AG$145,\"v\")","v":0},null,null,{"$f":"COUNTIF(AJ$126:AJ$145,\"v\")","v":0},null,null,{"$f":"COUNTIF(AM$126:AM$145,\"v\")","v":0},null,null,{"$f":"COUNTIF(AP$126:AP$145,\"v\")","v":0},null,null,{"$f":"COUNTIF(AS$126:AS$145,\"v\")","v":0},null,null,{"$f":"COUNTIF(AV$126:AV$145,\"v\")","v":0},null,null,{"$f":"COUNTIF(AY$126:AY$145,\"v\")","v":0},null,null,{"$f":"COUNTIF(BB$126:BB$145,\"v\")","v":0},null,null,{"$f":"COUNTIF(BE$126:BE$145,\"v\")","v":0},null,null,{"$f":"COUNTIF(BH$126:BH$145,\"v\")","v":0},null,null,{"$f":"COUNTIF(BK$126:BK$145,\"v\")","v":0},null,null,null,null,null,null,null,null,null,"Periodekampioen of vervanger"]
[null,"Gelijk uit",null,{"$f":"COUNTIF(F$126:F$145,\"g\")","v":0},null,null,{"$f":"COUNTIF(I$126:I$145,\"g\")","v":0},null,null,{"$f":"COUNTIF(L$126:L$145,\"g\")","v":0},null,null,{"$f":"COUNTIF(O$126:O$145,\"g\")","v":0},null,null,{"$f":"COUNTIF(R$126:R$145,\"g\")","v":0},null,null,{"$f":"COUNTIF(U$126:U$145,\"g\")","v":0},null,null,{"$f":"COUNTIF(X$126:X$145,\"g\")","v":0},null,null,{"$f":"COUNTIF(AA$126:AA$145,\"g\")","v":0},null,null,{"$f":"COUNTIF(AD$126:AD$145,\"g\")","v":0},null,null,{"$f":"COUNTIF(AG$126:AG$145,\"g\")","v":0},null,null,{"$f":"COUNTIF(AJ$126:AJ$145,\"g\")","v":0},null,null,{"$f":"COUNTIF(AM$126:AM$145,\"g\")","v":0},null,null,{"$f":"COUNTIF(AP$126:AP$145,\"g\")","v":0},null,null,{"$f":"COUNTIF(AS$126:AS$145,\"g\")","v":0},null,null,{"$f":"COUNTIF(AV$126:AV$145,\"g\")","v":0},null,null,{"$f":"COUNTIF(AY$126:AY$145,\"g\")","v":0},null,null,{"$f":"COUNTIF(BB$126:BB$145,\"g\")","v":0},null,null,{"$f":"COUNTIF(BE$126:BE$145,\"g\")","v":0},null,null,{"$f":"COUNTIF(BH$126:BH$145,\"g\")","v":0},null,null,{"$f":"COUNTIF(BK$126:BK$145,\"g\")","v":0}]
[null,"Verlies uit",null,{"$f":"COUNTIF(F$126:F$145,\"w\")","v":0},null,null,{"$f":"COUNTIF(I$126:I$145,\"w\")","v":0},null,null,{"$f":"COUNTIF(L$126:L$145,\"w\")","v":0},null,null,{"$f":"COUNTIF(O$126:O$145,\"w\")","v":0},null,null,{"$f":"COUNTIF(R$126:R$145,\"w\")","v":0},null,null,{"$f":"COUNTIF(U$126:U$145,\"w\")","v":0},null,null,{"$f":"COUNTIF(X$126:X$145,\"w\")","v":0},null,null,{"$f":"COUNTIF(AA$126:AA$145,\"w\")","v":0},null,null,{"$f":"COUNTIF(AD$126:AD$145,\"w\")","v":0},null,null,{"$f":"COUNTIF(AG$126:AG$145,\"w\")","v":0},null,null,{"$f":"COUNTIF(AJ$126:AJ$145,\"w\")","v":0},null,null,{"$f":"COUNTIF(AM$126:AM$145,\"w\")","v":0},null,null,{"$f":"COUNTIF(AP$126:AP$145,\"w\")","v":0},null,null,{"$f":"COUNTIF(AS$126:AS$145,\"w\")","v":0},null,null,{"$f":"COUNTIF(AV$126:AV$145,\"w\")","v":0},null,null,{"$f":"COUNTIF(AY$126:AY$145,\"w\")","v":0},null,null,{"$f":"COUNTIF(BB$126:BB$145,\"w\")","v":0},null,null,{"$f":"COUNTIF(BE$126:BE$145,\"w\")","v":0},null,null,{"$f":"COUNTIF(BH$126:BH$145,\"w\")","v":0},null,null,{"$f":"COUNTIF(BK$126:BK$145,\"w\")","v":0}]
[null,"Vóór uit",null,{"$f":"SUM(E126:E145)","v":0},null,null,{"$f":"SUM(H126:H145)","v":0},null,null,{"$f":"SUM(K126:K145)","v":0},null,null,{"$f":"SUM(N126:N145)","v":0},null,null,{"$f":"SUM(Q126:Q145)","v":0},null,null,{"$f":"SUM(T126:T145)","v":0},null,null,{"$f":"SUM(W126:W145)","v":0},null,null,{"$f":"SUM(Z126:Z145)","v":0},null,null,{"$f":"SUM(AC126:AC145)","v":0},null,null,{"$f":"SUM(AF126:AF145)","v":0},null,null,{"$f":"SUM(AI126:AI145)","v":0},null,null,{"$f":"SUM(AL126:AL145)","v":0},null,null,{"$f":"SUM(AO126:AO145)","v":0},null,null,{"$f":"SUM(AR126:AR145)","v":0},null,null,{"$f":"SUM(AU126:AU145)","v":0},null,null,{"$f":"SUM(AX126:AX145)","v":0},null,null,{"$f":"SUM(BA126:BA145)","v":0},null,null,{"$f":"SUM(BD126:BD145)","v":0},null,null,{"$f":"SUM(BG126:BG145)","v":0},null,null,{"$f":"SUM(BJ126:BJ145)","v":0}]
[null,"Tegen uit",null,{"$f":"SUM(D126:D145)","v":0},null,null,{"$f":"SUM(G126:G145)","v":0},null,null,{"$f":"SUM(J126:J145)","v":0},null,null,{"$f":"SUM(M126:M145)","v":0},null,null,{"$f":"SUM(P126:P145)","v":0},null,null,{"$f":"SUM(S126:S145)","v":0},null,null,{"$f":"SUM(V126:V145)","v":0},null,null,{"$f":"SUM(Y126:Y145)","v":0},null,null,{"$f":"SUM(AB126:AB145)","v":0},null,null,{"$f":"SUM(AE126:AE145)","v":0},null,null,{"$f":"SUM(AH126:AH145)","v":0},null,null,{"$f":"SUM(AK126:AK145)","v":0},null,null,{"$f":"SUM(AN126:AN145)","v":0},null,null,{"$f":"SUM(AQ126:AQ145)","v":0},null,null,{"$f":"SUM(AT126:AT145)","v":0},null,null,{"$f":"SUM(AW126:AW145)","v":0},null,null,{"$f":"SUM(AZ126:AZ145)","v":0},null,null,{"$f":"SUM(BC126:BC145)","v":0},null,null,{"$f":"SUM(BF126:BF145)","v":0},null,null,{"$f":"SUM(BI126:BI145)","v":0}]

{"sheet":"TweedeDivisie","index":5,"n_rows":29,"n_cols":75,"rows_kept":29,"cut":false,"hidden":false,"merged":[[0,1,0,74]]}
[null,{"$f":"\"Competitie \"&Comp","v":"Competitie 2018-2019"}]
[]
[null,"TweedeDivisie"]
[]
[null,null,null,{"$f":"$B$6","v":"Katwijk"},null,null,{"$f":"$B$7","v":"IJsselmeervogels"},null,null,{"$f":"$B$8","v":"Jong Sparta Rotterdam"},null,null,{"$f":"$B$9","v":"Rijnsburgse Boys"},null,null,{"$f":"$B$10","v":"FC Lienden"},null,null,{"$f":"$B$11","v":"AFC"},null,null,{"$f":"$B$12","v":"Excelsior Maassluis"},null,null,{"$f":"$B$13","v":"Spakenburg"},null,null,{"$f":"$B$14","v":"Jong Vitesse"},null,null,{"$f":"$B$15","v":"VVSB"},null,null,{"$f":"$B$16","v":"Koninklijke HFC"},null,null,{"$f":"$B$17","v":"Barendrecht"},null,null,{"$f":"$B$18","v":"GVVV"},null,null,{"$f":"$B$19","v":"Kozakken Boys"},null,null,{"$f":"$B$20","v":"HHC Hardenberg"},null,null,{"$f":"$B$21","v":"Scheveningen"},null,null,{"$f":"$B$22","v":"Jong Almere City FC"},null,null,{"$f":"$B$23","v":"De Treffers"},null,null,"Winst thuis","Gelijk thuis","Verlies thuis","Vóór thuis","Tegen thuis",null,"Plaats","Team","Gespeeld","Winst","Gelijk","Verlies","Straf","Punten","Doelsaldo","Vóór","Tegen","Code"]
[null,{"$f":"BM6","v":"Katwijk"},null,null,null,null,{"$f":"IF(ISBLANK(VLOOKUP(TEXT($B6,)&\" - \"&TEXT($G$5,),SchemaTD,2,0)),\"\",VLOOKUP(TEXT($B6,)&\" - \"&TEXT($G$5,),SchemaTD,2,0))","v":""},{"$f":"IF(ISBLANK(VLOOKUP(TEXT($B6,)&\" - \"&TEXT($G$5,),SchemaTD,3,0)),\"\",VLOOKUP(TEXT($B6,)&\" - \"&TEXT($G$5,),SchemaTD,3,0))","v":""},{"$f":"IF(H6=\"\",\"\",IF(G6>H6,\"w\",IF(G6=H6,\"g\",\"v\")))","v":""},{"$f":"IF(ISBLANK(VLOOKUP(TEXT($B6,)&\" - \"&TEXT($J$5,),SchemaTD,2,0)),\"\",VLOOKUP(TEXT($B6,)&\" - \"&TEXT($J$5,),SchemaTD,2,0))","v":""},{"$f":"IF(ISBLANK(VLOOKUP(TEXT($B6,)&\" - \"&TEXT($J$5,),SchemaTD,3,0)),\"\",VLOOKUP(TEXT($B6,)&\" - \"&TEXT($J$5,),SchemaTD,3,0))","v":""},{"$f":"IF(K6=\"\",\"\",IF(J6>K6,\"w\",IF(J6=K6,\"g\",\"v\")))","v":""},{"$f":"IF(ISBLANK(VLOOKUP(TEXT($B6,)&\" - \"&TEXT($M$5,),SchemaTD,2,0)),\"\",VLOOKUP(TEXT($B6,)&\" - \"&TEXT($M$5,),SchemaTD,2,0))","v":""},{"$f":"IF(ISBLANK(VLOOKUP(TEXT($B6,)&\" - \"&TEXT($M$5,),SchemaTD,3,0)),\"\",VLOOKUP(TEXT($B6,)&\" - \"&TEXT($M$5,),SchemaTD,3,0))","v":""},{"$f":"IF(N6=\"\",\"\",IF(M6>N6,\"w\",IF(M6=N6,\"g\",\"v\")))","v":""},{"$f":"IF(ISBLANK(VLOOKUP(TEXT($B6,)&\" - \"&TEXT($P$5,),SchemaTD,2,0)),\"\",VLOOKUP(TEXT($B6,)&\" - \"&TEXT($P$5,),SchemaTD,2,0))","v":""},{"$f":"IF(ISBLANK(VLOOKUP(TEXT($B6,)&\" - \"&TEXT($P$5,),SchemaTD,3,0)),\"\",VLOOKUP(TEXT($B6,)&\" - \"&TEXT($P$5,),SchemaTD,3,0))","v":""},{"$f":"IF(Q6=\"\",\"\",IF(P6>Q6,\"w\",IF(P6=Q6,\"g\",\"v\")))","v":""},{"$f":"IF(ISBLANK(VLOOKUP(TEXT($B6,)&\" - \"&TEXT($S$5,),SchemaTD,2,0)),\"\",VLOOKUP(TEXT($B6,)&\" - \"&TEXT($S$5,),SchemaTD,2,0))","v":""},{"$f":"IF(ISBLANK(VLOOKUP(TEXT($B6,)&\" - \"&TEXT($S$5,),SchemaTD,3,0)),\"\",VLOOKUP(TEXT($B6,)&\" - \"&TEXT($S$5,),SchemaTD,3,0))","v":""},{"$f":"IF(T6=\"\",\"\",IF(S6>T6,\"w\",IF(S6=T6,\"g\",\"v\")))","v":""},{"$f":"IF(ISBLANK(VLOOKUP(TEXT($B6,)&\" - \"&TEXT($V$5,),SchemaTD,2,0)),\"\",VLOOKUP(TEXT($B6,)&\" - \"&TEXT($V$5,),SchemaTD,2,0))","v":""},{"$f":"IF(ISBLANK(VLOOKUP(TEXT($B6,)&\" - \"&TEXT($V$5,),SchemaTD,3,0)),\"\",VLOOKUP(TEXT($B6,)&\" - \"&TEXT($V$5,),SchemaTD,3,0))","v":""},{"$f":"IF(W6=\"\",\"\",IF(V6>W6,\"w\",IF(V6=W6,\"g\",\"v\")))","v":""},{"$f":"IF(ISBLANK(VLOOKUP(TEXT($B6,)&\" - \"&TEXT($Y$5,),SchemaTD,2,0)),\"\",VLOOKUP(TEXT($B6,)&\" - \"&TEXT($Y$5,),SchemaTD,2,0))","v":""},{"$f":"IF(ISBLANK(VLOOKUP(TEXT($B6,)&\" - \"&TEXT($Y$5,),SchemaTD,3,0)),\"\",VLOOKUP(TEXT($B6,)&\" - \"&TEXT($Y$5,),SchemaTD,3,0))","v":""},{"$f":"IF(Z6=\"\",\"\",IF(Y6>Z6,\"w\",IF(Y6=Z6,\"g\",\"v\")))","v":""},{"$f":"IF(ISBLANK(VLOOKUP(TEXT($B6,)&\" - \"&TEXT($AB$5,),SchemaTD,2,0)),\"\",VLOOKUP(TEXT($B6,)&\" - \"&TEXT($AB$5,),SchemaTD,2,0))","v":""},{"$f":"IF(ISBLANK(VLOOKUP(TEXT($B6,)&\" - \"&TEXT($AB$5,),SchemaTD,3,0)),\"\",VLOOKUP(TEXT($B6,)&\" - \"&TEXT($AB$5,),SchemaTD,3,0))","v":""},{"$f":"IF(AC6=\"\",\"\",IF(AB6>AC6,\"w\",IF(AB6=AC6,\"g\",\"v\")))","v":""},{"$f":"IF(ISBLANK(VLOOKUP(TEXT($B6,)&\" - \"&TEXT($AE$5,),SchemaTD,2,0)),\"\",VLOOKUP(TEXT($B6,)&\" - \"&TEXT($AE$5,),SchemaTD,2,0))","v":""},{"$f":"IF(ISBLANK(VLOOKUP(TEXT($B6,)&\" - \"&TEXT($AE$5,),SchemaTD,3,0)),\"\",VLOOKUP(TEXT($B6,)&\" - \"&TEXT($AE$5,),SchemaTD,3,0))","v":""},{"$f":"IF(AF6=\"\",\"\",IF(AE6>AF6,\"w\",IF(AE6=AF6,\"g\",\"v\")))","v":""},{"$f":"IF(ISBLANK(VLOOKUP(TEXT($B6,)&\" - \"&TEXT($AH$5,),SchemaTD,2,0)),\"\",VLOOKUP(TEXT($B6,)&\" - \"&TEXT($AH$5,),SchemaTD,2,0))","v":""},{"$f":"IF(ISBLANK(VLOOKUP(TEXT($B6,)&\" - \"&TEXT($AH$5,),SchemaTD,3,0)),\"\",VLOOKUP(TEXT($B6,)&\" - \"&TEXT($AH$5,),SchemaTD,3,0))","v":""},{"$f":"IF(AI6=\"\",\"\",IF(AH6>AI6,\"w\",IF(AH6=AI6,\"g\",\"v\")))","v":""},{"$f":"IF(ISBLANK(VLOOKUP(TEXT($B6,)&\" - \"&TEXT($AK$5,),SchemaTD,2,0)),\"\",VLOOKUP(TEXT($B6,)&\" - \"&TEXT($AK$5,),SchemaTD,2,0))","v":""},{"$f":"IF(ISBLANK(VLOOKUP(TEXT($B6,)&\" - \"&TEXT($AK$5,),SchemaTD,3,0)),\"\",VLOOKUP(TEXT($B6,)&\" - \"&TEXT($AK$5,),SchemaTD,3,0))","v":""},{"$f":"IF(AL6=\"\",\"\",IF(AK6>AL6,\"w\",IF(AK6=AL6,\"g\",\"v\")))","v":""},{"$f":"IF(ISBLANK(VLOOKUP(TEXT($B6,)&\" - \"&TEXT($AN$5,),SchemaTD,2,0)),\"\",VLOOKUP(TEXT($B6,)&\" - \"&TEXT($AN$5,),SchemaTD,2,0))","v":""},{"$f":"IF(ISBLANK(VLOOKUP(TEXT($B6,)&\" - \"&TEXT($AN$5,),SchemaTD,3,0)),\"\",VLOOKUP(TEXT($B6,)&\" - \"&TEXT($AN$5,),SchemaTD,3,0))","v":""},{"$f":"IF(AO6=\"\",\"\",IF(AN6>AO6,\"w\",IF(AN6=AO6,\"g\",\"v\")))","v":""},{"$f":"IF(ISBLANK(VLOOKUP(TEXT($B6,)&\" - \"&TEXT($AQ$5,),SchemaTD,2,0)),\"\",VLOOKUP(TEXT($B6,)&\" - \"&TEXT($AQ$5,),SchemaTD,2,0))","v":""},{"$f":"IF(ISBLANK(VLOOKUP(TEXT($B6,)&\" - \"&TEXT($AQ$5,),SchemaTD,3,0)),\"\",VLOOKUP(TEXT($B6,)&\" - \"&TEXT($AQ$5,),SchemaTD,3,0))","v":""},{"$f":"IF(AR6=\"\",\"\",IF(AQ6>AR6,\"w\",IF(AQ6=AR6,\"g\",\"v\")))","v":""},{"$f":"IF(ISBLANK(VLOOKUP(TEXT($B6,)&\" - \"&TEXT($AT$5,),SchemaTD,2,0)),\"\",VLOOKUP(TEXT($B6,)&\" - \"&TEXT($AT$5,),SchemaTD,2,0))","v":""},{"$f":"IF(ISBLANK(VLOOKUP(TEXT($B6,)&\" - \"&TEXT($AT$5,),SchemaTD,3,0)),\"\",VLOOKUP(TEXT($B6,)&\" - \"&TEXT($AT$5,),SchemaTD,3,0))","v":""},{"$f":"IF(AU6=\"\",\"\",IF(AT6>AU6,\"w\",IF(AT6=AU6,\"g\",\"v\")))","v":""},{"$f":"IF(ISBLANK(VLOOKUP(TEXT($B6,)&\" - \"&TEXT($AW$5,),SchemaTD,2,0)),\"\",VLOOKUP(TEXT($B6,)&\" - \"&TEXT($AW$5,),SchemaTD,2,0))","v":""},{"$f":"IF(ISBLANK(VLOOKUP(TEXT($B6,)&\" - \"&TEXT($AW$5,),SchemaTD,3,0)),\"\",VLOOKUP(TEXT($B6,)&\" - \"&TEXT($AW$5,),SchemaTD,3,0))","v":""},{"$f":"IF(AX6=\"\",\"\",IF(AW6>AX6,\"w\",IF(AW6=AX6,\"g\",\"v\")))","v":""},{"$f":"IF(ISBLANK(VLOOKUP(TEXT($B6,)&\" - \"&TEXT($AZ$5,),SchemaTD,2,0)),\"\",VLOOKUP(TEXT($B6,)&\" - \"&TEXT($AZ$5,),SchemaTD,2,0))","v":""},{"$f":"IF(ISBLANK(VLOOKUP(TEXT($B6,)&\" - \"&TEXT($AZ$5,),SchemaTD,3,0)),\"\",VLOOKUP(TEXT($B6,)&\" - \"&TEXT($AZ$5,),SchemaTD,3,0))","v":""},{"$f":"IF(BA6=\"\",\"\",IF(AZ6>BA6,\"w\",IF(AZ6=BA6,\"g\",\"v\")))","v":""},{"$f":"IF(ISBLANK(VLOOKUP(TEXT($B6,)&\" - \"&TEXT($BC$5,),SchemaTD,2,0)),\"\",VLOOKUP(TEXT($B6,)&\" - \"&TEXT($BC$5,),SchemaTD,2,0))","v":""},{"$f":"IF(ISBLANK(VLOOKUP(TEXT($B6,)&\" - \"&TEXT($BC$5,),SchemaTD,3,0)),\"\",VLOOKUP(TEXT($B6,)&\" - \"&TEXT($BC$5,),SchemaTD,3,0))","v":""},{"$f":"IF(BD6=\"\",\"\",IF(BC6>BD6,\"w\",IF(BC6=BD6,\"g\",\"v\")))","v":""},{"$f":"COUNTIF(F6:BE6,\"w\")","v":0},{"$f":"COUNTIF(F6:BE6,\"g\")","v":0},{"$f":"COUNTIF(F6:BE6,\"v\")","v":0},{"$f":"SUM(D6,G6,J6,M6,P6,S6,V6,Y6,AB6,AE6,AH6,AK6,AN6,AQ6,AT6,AW6,AZ6,BC6)","v":0},{"$f":"SUM(E6,H6,K6,N6,Q6,T6,W6,Z6,AC6,AF6,AI6,AL6,AO6,AR6,AU6,AX6,BA6,BD6)","v":0},null,{"$f":"RANK(BW6,$BW$6:$BW$23)","v":1},"Katwijk",{"$f":"SUM(BO6:BQ6)","v":1},{"$f":"INDEX($BF$6:$BF$23,MATCH(BM6,$B$6:$B$23,0))+INDEX($D$25:$BD$25,MATCH(BM6,$D$5:$BD$5,0))","v":1},{"$f":"INDEX($BG$6:$BG$23,MATCH(BM6,$B$6:$B$23,0))+INDEX($D$26:$BD$26,MATCH(BM6,$D$5:$BD$5,0))","v":0},{"$f":"INDEX($BH$6:$BH$23,MATCH(BM6,$B$6:$B$23,0))+INDEX($D$27:$BD$27,MATCH(BM6,$D$5:$BD$5,0))","v":0},null,{"$f":"(BO6*3)+BP6+BR6","v":3},{"$f":"BU6-BV6","v":3},{"$f":"INDEX($BI$6:$BI$23,MATCH(BM6,$B$6:$B$23,0))+INDEX($D$28:$BD$28,MATCH(BM6,$D$5:$BD$5,0))","v":4},{"$f":"INDEX($BJ$6:$BJ$23,MATCH(BM6,$B$6:$B$23,0))+INDEX($D$29:$BD$29,MATCH(BM6,$D$5:$BD$5,0))","v":1},{"$f":"VALUE(TEXT(BS6,\"000\")&TEXT(100+BT6,\"000\")&TEXT(BU6,\"000\")&TEXT(100-BN6,\"00\")&TEXT(COUNTIF($BM$6:$BM$23,\">=\"&BM6),\"00\"))","v":31030049907}]
[null,{"$f":"BM7","v":"IJsselmeervogels"},null,{"$f":"IF(ISBLANK(VLOOKUP(TEXT($B7,)&\" - \"&TEXT($D$5,),SchemaTD,2,0)),\"\",VLOOKUP(TEXT($B7,)&\" - \"&TEXT($D$5,),SchemaTD,2,0))","v":""},{"$f":"IF(ISBLANK(VLOOKUP(TEXT($B7,)&\" - \"&TEXT($D$5,),SchemaTD,3,0)),\"\",VLOOKUP(TEXT($B7,)&\" - \"&TEXT($D$5,),SchemaTD,3,0))","v":""},{"$f":"IF(E7=\"\",\"\",IF(D7>E7,\"w\",IF(D7=E7,\"g\",\"v\")))","v":""},null,null,null,{"$f":"IF(ISBLANK(VLOOKUP(TEXT($B7,)&\" - \"&TEXT($J$5,),SchemaTD,2,0)),\"\",VLOOKUP(TEXT($B7,)&\" - \"&TEXT($J$5,),SchemaTD,2,0))","v":""},{"$f":"IF(ISBLANK(VLOOKUP(TEXT($B7,)&\" - \"&TEXT($J$5,),SchemaTD,3,0)),\"\",VLOOKUP(TEXT($B7,)&\" - \"&TEXT($J$5,),SchemaTD,3,0))","v":""},"",{"$f":"IF(ISBLANK(VLOOKUP(TEXT($B7,)&\" - \"&TEXT($M$5,),SchemaTD,2,0)),\"\",VLOOKUP(TEXT($B7,)&\" - \"&TEXT($M$5,),SchemaTD,2,0))","v":""},{"$f":"IF(ISBLANK(VLOOKUP(TEXT($B7,)&\" - \"&TEXT($M$5,),SchemaTD,3,0)),\"\",VLOOKUP(TEXT($B7,)&\" - \"&TEXT($M$5,),SchemaTD,3,0))","v":""},"",{"$f":"IF(ISBLANK(VLOOKUP(TEXT($B7,)&\" - \"&TEXT($P$5,),SchemaTD,2,0)),\"\",VLOOKUP(TEXT($B7,)&\" - \"&TEXT($P$5,),SchemaTD,2,0))","v":""},{"$f":"IF(ISBLANK(VLOOKUP(TEXT($B7,)&\" - \"&TEXT($P$5,),SchemaTD,3,0)),\"\",VLOOKUP(TEXT($B7,)&\" - \"&TEXT($P$5,),SchemaTD,3,0))","v":""},"",{"$f":"IF(ISBLANK(VLOOKUP(TEXT($B7,)&\" - \"&TEXT($S$5,),SchemaTD,2,0)),\"\",VLOOKUP(TEXT($B7,)&\" - \"&TEXT($S$5,),SchemaTD,2,0))","v":""},{"$f":"IF(ISBLANK(VLOOKUP(TEXT($B7,)&\" - \"&TEXT($S$5,),SchemaTD,3,0)),\"\",VLOOKUP(TEXT($B7,)&\" - \"&TEXT($S$5,),SchemaTD,3,0))","v":""},"","","","","","","","","","","","","","","","","","","","","","","","","","","","","","","","","","","","","",0,0,{"$f":"COUNTIF(F7:BE7,\"v\")","v":0},0,0,null,2,"IJsselmeervogels",1,1,0,0,null,3,2,3,1,31020039911]
[null,"Jong Sparta Rotterdam",null,"","","",{"$f":"IF(ISBLANK(VLOOKUP(TEXT($B8,)&\" - \"&TEXT($G$5,),SchemaTD,2,0)),\"\",VLOOKUP(TEXT($B8,)&\" - \"&TEXT($G$5,),SchemaTD,2,0))","v":""},{"$f":"IF(ISBLANK(VLOOKUP(TEXT($B8,)&\" - \"&TEXT($G$5,),SchemaTD,3,0)),\"\",VLOOKUP(TEXT($B8,)&\" - \"&TEXT($G$5,),SchemaTD,3,0))","v":""},"",null,null,null,{"$f":"IF(ISBLANK(VLOOKUP(TEXT($B8,)&\" - \"&TEXT($M$5,),SchemaTD,2,0)),\"\",VLOOKUP(TEXT($B8,)&\" - \"&TEXT($M$5,),SchemaTD,2,0))","v":""},{"$f":"IF(ISBLANK(VLOOKUP(TEXT($B8,)&\" - \"&TEXT($M$5,),SchemaTD,3,0)),\"\",VLOOKUP(TEXT($B8,)&\" - \"&TEXT($M$5,),SchemaTD,3,0))","v":""},"",{"$f":"IF(ISBLANK(VLOOKUP(TEXT($B8,)&\" - \"&TEXT($P$5,),SchemaTD,2,0)),\"\",VLOOKUP(TEXT($B8,)&\" - \"&TEXT($P$5,),SchemaTD,2,0))","v":""},{"$f":"IF(ISBLANK(VLOOKUP(TEXT($B8,)&\" - \"&TEXT($P$5,),SchemaTD,3,0)),\"\",VLOOKUP(TEXT($B8,)&\" - \"&TEXT($P$5,),SchemaTD,3,0))","v":""},"",{"$f":"IF(ISBLANK(VLOOKUP(TEXT($B8,)&\" - \"&TEXT($S$5,),SchemaTD,2,0)),\"\",VLOOKUP(TEXT($B8,)&\" - \"&TEXT($S$5,),SchemaTD,2,0))","v":""},{"$f":"IF(ISBLANK(VLOOKUP(TEXT($B8,)&\" - \"&TEXT($S$5,),SchemaTD,3,0)),\"\",VLOOKUP(TEXT($B8,)&\" - \"&TEXT($S$5,),SchemaTD,3,0))","v":""},"","","","","","","","","","","","","","","","","","","","","","","","","",3,1,"w","","","","","","","","","",1,0,0,3,1,null,3,"Jong Sparta Rotterdam",1,1,0,0,null,3,2,3,1,31020039909]
[null,"Rijnsburgse Boys",null,"","","","","","",{"$f":"IF(ISBLANK(VLOOKUP(TEXT($B9,)&\" - \"&TEXT($J$5,),SchemaTD,2,0)),\"\",VLOOKUP(TEXT($B9,)&\" - \"&TEXT($J$5,),SchemaTD,2,0))","v":""},{"$f":"IF(ISBLANK(VLOOKUP(TEXT($B9,)&\" - \"&TEXT($J$5,),SchemaTD,3,0)),\"\",VLOOKUP(TEXT($B9,)&\" - \"&TEXT($J$5,),SchemaTD,3,0))","v":""},"",null,null,null,{"$f":"IF(ISBLANK(VLOOKUP(TEXT($B9,)&\" - \"&TEXT($P$5,),SchemaTD,2,0)),\"\",VLOOKUP(TEXT($B9,)&\" - \"&TEXT($P$5,),SchemaTD,2,0))","v":""},{"$f":"IF(ISBLANK(VLOOKUP(TEXT($B9,)&\" - \"&TEXT($P$5,),SchemaTD,3,0)),\"\",VLOOKUP(TEXT($B9,)&\" - \"&TEXT($P$5,),SchemaTD,3,0))","v":""},"",{"$f":"IF(ISBLANK(VLOOKUP(TEXT($B9,)&\" - \"&TEXT($S$5,),SchemaTD,2,0)),\"\",VLOOKUP(TEXT($B9,)&\" - \"&TEXT($S$5,),SchemaTD,2,0))","v":""},{"$f":"IF(ISBLANK(VLOOKUP(TEXT($B9,)&\" - \"&TEXT($S$5,),SchemaTD,3,0)),\"\",VLOOKUP(TEXT($B9,)&\" - \"&TEXT($S$5,),SchemaTD,3,0))","v":""},"","","","","","","","","","","","","","","","","","","","","","","","","","","","","","","","","","","","","",0,0,0,0,0,null,4,"Rijnsburgse Boys",1,1,0,0,null,3,2,2,0,31020029904]
[null,"FC Lienden",null,"","","","","","","","","",{"$f":"IF(ISBLANK(VLOOKUP(TEXT($B10,)&\" - \"&TEXT($M$5,),SchemaTD,2,0)),\"\",VLOOKUP(TEXT($B10,)&\" - \"&TEXT($M$5,),SchemaTD,2,0))","v":""},{"$f":"IF(ISBLANK(VLOOKUP(TEXT($B10,)&\" - \"&TEXT($M$5,),SchemaTD,3,0)),\"\",VLOOKUP(TEXT($B10,)&\" - \"&TEXT($M$5,),SchemaTD,3,0))","v":""},"",null,null,null,{"$f":"IF(ISBLANK(VLOOKUP(TEXT($B10,)&\" - \"&TEXT($S$5,),SchemaTD,2,0)),\"\",VLOOKUP(TEXT($B10,)&\" - \"&TEXT($S$5,),SchemaTD,2,0))","v":""},{"$f":"IF(ISBLANK(VLOOKUP(TEXT($B10,)&\" - \"&TEXT($S$5,),SchemaTD,3,0)),\"\",VLOOKUP(TEXT($B10,)&\" - \"&TEXT($S$5,),SchemaTD,3,0))","v":""},"","","","","","","","","","","","","","","","","","","","","","","","","","","","","","","","","","","","","",0,0,0,0,0,null,5,"FC Lienden",1,1,0,0,null,3,1,2,1,31010029914]
[null,"AFC",null,"","","","","","","","","","","","",{"$f":"IF(ISBLANK(VLOOKUP(TEXT($B11,)&\" - \"&TEXT($P$5,),SchemaTD,2,0)),\"\",VLOOKUP(TEXT($B11,)&\" - \"&TEXT($P$5,),SchemaTD,2,0))","v":""},{"$f":"IF(ISBLANK(VLOOKUP(TEXT($B11,)&\" - \"&TEXT($P$5,),SchemaTD,3,0)),\"\",VLOOKUP(TEXT($B11,)&\" - \"&TEXT($P$5,),SchemaTD,3,0))","v":""},"",null,null,null,"","","","","","","","","","","","","","","","","","","","","","","","","","","","","","","","","","","","",0,0,0,0,0,null,6,"AFC",1,1,0,0,null,3,1,1,0,31010019918]
[null,"Excelsior Maassluis",null,"","","","","","","","","","","","","","","",{"$f":"IF(ISBLANK(VLOOKUP(TEXT($B12,)&\" - \"&TEXT($S$5,),SchemaTD,2,0)),\"\",VLOOKUP(TEXT($B12,)&\" - \"&TEXT($S$5,),SchemaTD,2,0))","v":""},{"$f":"IF(ISBLANK(VLOOKUP(TEXT($B12,)&\" - \"&TEXT($S$5,),SchemaTD,3,0)),\"\",VLOOKUP(TEXT($B12,)&\" - \"&TEXT($S$5,),SchemaTD,3,0))","v":""},"",null,null,null,"","","","","","","","","","","","","","","",1,0,"w","","","","","","","","","","","","","","","",1,0,0,1,0,null,7,"Excelsior Maassluis",1,1,0,0,null,3,1,1,0,31010019915]
[null,"Spakenburg",null,"","","","","","","","","","","","","","","","","","",{"$f":"IF(ISBLANK(VLOOKUP(TEXT($B13,)&\" - \"&TEXT($V$5,),SchemaTD,2,0)),\"\",VLOOKUP(TEXT($B13,)&\" - \"&TEXT($V$5,),SchemaTD,2,0))","v":""},{"$f":"IF(ISBLANK(VLOOKUP(TEXT($B13,)&\" - \"&TEXT($V$5,),SchemaTD,3,0)),\"\",VLOOKUP(TEXT($B13,)&\" - \"&TEXT($V$5,),SchemaTD,3,0))","v":""},"",null,null,null,"","","","","","","","","",1,0,"w","","","","","","","","","","","","","","","","","","",1,0,0,1,0,null,8,"Spakenburg",1,1,0,0,null,3,1,1,0,31010019902]
[null,"Jong Vitesse",null,"","","","","","","","","","","","","","","","","","","","","",{"$f":"IF(ISBLANK(VLOOKUP(TEXT($B14,)&\" - \"&TEXT($Y$5,),SchemaTD,2,0)),\"\",VLOOKUP(TEXT($B14,)&\" - \"&TEXT($Y$5,),SchemaTD,2,0))","v":""},{"$f":"IF(ISBLANK(VLOOKUP(TEXT($B14,)&\" - \"&TEXT($Y$5,),SchemaTD,3,0)),\"\",VLOOKUP(TEXT($B14,)&\" - \"&TEXT($Y$5,),SchemaTD,3,0))","v":""},"",null,null,null,"","","","","","","","","","","","","","","","","","","","","","","","","","","",0,0,0,0,0,null,9,"Jong Vitesse",1,0,1,0,null,1,0,2,2,11000029908]
[null,"VVSB",null,"","","","","","","","","","","","","","","","","","","","","","","","",{"$f":"IF(ISBLANK(VLOOKUP(TEXT($B15,)&\" - \"&TEXT($AB$5,),SchemaTD,2,0)),\"\",VLOOKUP(TEXT($B15,)&\" - \"&TEXT($AB$5,),SchemaTD,2,0))","v":2},{"$f":"IF(ISBLANK(VLOOKUP(TEXT($B15,)&\" - \"&TEXT($AB$5,),SchemaTD,3,0)),\"\",VLOOKUP(TEXT($B15,)&\" - \"&TEXT($AB$5,),SchemaTD,3,0))","v":2},"g",null,null,null,"","","","","","","","","","","","","","","","","","","","","","","","",0,1,0,2,2,null,10,"VVSB",1,0,1,0,null,1,0,2,2,11000029901]
[null,"Koninklijke HFC",null,"","","","","","","","","","","","",1,2,"v","","","","","","","","","","","","",{"$f":"IF(ISBLANK(VLOOKUP(TEXT($B16,)&\" - \"&TEXT($AE$5,),SchemaTD,2,0)),\"\",VLOOKUP(TEXT($B16,)&\" - \"&TEXT($AE$5,),SchemaTD,2,0))","v":""},{"$f":"IF(ISBLANK(VLOOKUP(TEXT($B16,)&\" - \"&TEXT($AE$5,),SchemaTD,3,0)),\"\",VLOOKUP(TEXT($B16,)&\" - \"&TEXT($AE$5,),SchemaTD,3,0))","v":""},"",null,null,null,"","","","","","","","","","","","","","","","","","","","","",0,0,1,1,2,null,11,"Koninklijke HFC",1,0,0,1,null,0,-1,1,2,990019906]
[null,"Barendrecht",null,"","","","","","","","","","","","","","","","","","","","","","","","","","","","","","",{"$f":"IF(ISBLANK(VLOOKUP(TEXT($B17,)&\" - \"&TEXT($AH$5,),SchemaTD,2,0)),\"\",VLOOKUP(TEXT($B17,)&\" - \"&TEXT($AH$5,),SchemaTD,2,0))","v":""},{"$f":"IF(ISBLANK(VLOOKUP(TEXT($B17,)&\" - \"&TEXT($AH$5,),SchemaTD,3,0)),\"\",VLOOKUP(TEXT($B17,)&\" - \"&TEXT($AH$5,),SchemaTD,3,0))","v":""},"",null,null,null,"","","","","","","","","","","","","","","","","","",0,0,0,0,0,null,12,"Barendrecht",1,0,0,1,null,0,-1,0,1,990009917]
[null,"GVVV",null,"","","","","","","","","","","","","","","","","","","","","","","","","","","","","","","","","",{"$f":"IF(ISBLANK(VLOOKUP(TEXT($B18,)&\" - \"&TEXT($AK$5,),SchemaTD,2,0)),\"\",VLOOKUP(TEXT($B18,)&\" - \"&TEXT($AK$5,),SchemaTD,2,0))","v":""},{"$f":"IF(ISBLANK(VLOOKUP(TEXT($B18,)&\" - \"&TEXT($AK$5,),SchemaTD,3,0)),\"\",VLOOKUP(TEXT($B18,)&\" - \"&TEXT($AK$5,),SchemaTD,3,0))","v":""},"",null,null,null,"","","","","","","","","","","","","","","",0,0,0,0,0,null,13,"GVVV",1,0,0,1,null,0,-1,0,1,990009913]
[null,"Kozakken Boys",null,"","","","","","","","","","","","","","","",0,1,"v","","","","","","","","","","","","","","","","","","",{"$f":"IF(ISBLANK(VLOOKUP(TEXT($B19,)&\" - \"&TEXT($AN$5,),SchemaTD,2,0)),\"\",VLOOKUP(TEXT($B19,)&\" - \"&TEXT($AN$5,),SchemaTD,2,0))","v":""},{"$f":"IF(ISBLANK(VLOOKUP(TEXT($B19,)&\" - \"&TEXT($AN$5,),SchemaTD,3,0)),\"\",VLOOKUP(TEXT($B19,)&\" - \"&TEXT($AN$5,),SchemaTD,3,0))","v":""},"",null,null,null,"","","","","","","","","","","","",0,0,1,0,1,null,14,"Kozakken Boys",1,0,0,1,null,0,-1,0,1,990009905]
[null,"HHC Hardenberg",null,"","","","","","","","","","","","","","","","","","","","","","","","","","","","","","","","","","","","",{"$f":"IF(ISBLANK(VLOOKUP(TEXT($B20,)&\" - \"&TEXT($AN$5,),SchemaTD,2,0)),\"\",VLOOKUP(TEXT($B20,)&\" - \"&TEXT($AN$5,),SchemaTD,2,0))","v":""},{"$f":"IF(ISBLANK(VLOOKUP(TEXT($B20,)&\" - \"&TEXT($AN$5,),SchemaTD,3,0)),\"\",VLOOKUP(TEXT($B20,)&\" - \"&TEXT($AN$5,),SchemaTD,3,0))","v":""},"",{"$f":"IF(ISBLANK(VLOOKUP(TEXT($B20,)&\" - \"&TEXT($AQ$5,),SchemaTD,2,0)),\"\",VLOOKUP(TEXT($B20,)&\" - \"&TEXT($AQ$5,),SchemaTD,2,0))","v":""},{"$f":"IF(ISBLANK(VLOOKUP(TEXT($B20,)&\" - \"&TEXT($AQ$5,),SchemaTD,3,0)),\"\",VLOOKUP(TEXT($B20,)&\" - \"&TEXT($AQ$5,),SchemaTD,3,0))","v":""},"",null,null,null,"","","","","","","","","",0,0,0,0,0,null,15,"HHC Hardenberg",1,0,0,1,null,0,-2,1,3,980019912]
[null,"Scheveningen",null,"","","",1,3,"v","","","","","","","","","","","","","","","","","","","","","","","","","","","","","","",{"$f":"IF(ISBLANK(VLOOKUP(TEXT($B21,)&\" - \"&TEXT($AN$5,),SchemaTD,2,0)),\"\",VLOOKUP(TEXT($B21,)&\" - \"&TEXT($AN$5,),SchemaTD,2,0))","v":""},{"$f":"IF(ISBLANK(VLOOKUP(TEXT($B21,)&\" - \"&TEXT($AN$5,),SchemaTD,3,0)),\"\",VLOOKUP(TEXT($B21,)&\" - \"&TEXT($AN$5,),SchemaTD,3,0))","v":""},"",{"$f":"IF(ISBLANK(VLOOKUP(TEXT($B21,)&\" - \"&TEXT($AQ$5,),SchemaTD,2,0)),\"\",VLOOKUP(TEXT($B21,)&\" - \"&TEXT($AQ$5,),SchemaTD,2,0))","v":""},{"$f":"IF(ISBLANK(VLOOKUP(TEXT($B21,)&\" - \"&TEXT($AQ$5,),SchemaTD,3,0)),\"\",VLOOKUP(TEXT($B21,)&\" - \"&TEXT($AQ$5,),SchemaTD,3,0))","v":""},"",{"$f":"IF(ISBLANK(VLOOKUP(TEXT($B21,)&\" - \"&TEXT($AT$5,),SchemaTD,2,0)),\"\",VLOOKUP(TEXT($B21,)&\" - \"&TEXT($AT$5,),SchemaTD,2,0))","v":""},{"$f":"IF(ISBLANK(VLOOKUP(TEXT($B21,)&\" - \"&TEXT($AT$5,),SchemaTD,3,0)),\"\",VLOOKUP(TEXT($B21,)&\" - \"&TEXT($AT$5,),SchemaTD,3,0))","v":""},"",null,null,null,"","","","","","",0,0,1,1,3,null,16,"Scheveningen",1,0,0,1,null,0,-2,1,3,980019903]
[null,"Jong Almere City FC",null,"","","","","","","","","",0,2,"v","","","","","","","","","","","","","","","","","","","","","","","","",{"$f":"IF(ISBLANK(VLOOKUP(TEXT($B22,)&\" - \"&TEXT($AN$5,),SchemaTD,2,0)),\"\",VLOOKUP(TEXT($B22,)&\" - \"&TEXT($AN$5,),SchemaTD,2,0))","v":""},{"$f":"IF(ISBLANK(VLOOKUP(TEXT($B22,)&\" - \"&TEXT($AN$5,),SchemaTD,3,0)),\"\",VLOOKUP(TEXT($B22,)&\" - \"&TEXT($AN$5,),SchemaTD,3,0))","v":""},"",{"$f":"IF(ISBLANK(VLOOKUP(TEXT($B22,)&\" - \"&TEXT($AQ$5,),SchemaTD,2,0)),\"\",VLOOKUP(TEXT($B22,)&\" - \"&TEXT($AQ$5,),SchemaTD,2,0))","v":""},{"$f":"IF(ISBLANK(VLOOKUP(TEXT($B22,)&\" - \"&TEXT($AQ$5,),SchemaTD,3,0)),\"\",VLOOKUP(TEXT($B22,)&\" - \"&TEXT($AQ$5,),SchemaTD,3,0))","v":""},"",{"$f":"IF(ISBLANK(VLOOKUP(TEXT($B22,)&\" - \"&TEXT($AT$5,),SchemaTD,2,0)),\"\",VLOOKUP(TEXT($B22,)&\" - \"&TEXT($AT$5,),SchemaTD,2,0))","v":""},{"$f":"IF(ISBLANK(VLOOKUP(TEXT($B22,)&\" - \"&TEXT($AT$5,),SchemaTD,3,0)),\"\",VLOOKUP(TEXT($B22,)&\" - \"&TEXT($AT$5,),SchemaTD,3,0))","v":""},"",{"$f":"IF(ISBLANK(VLOOKUP(TEXT($B22,)&\" - \"&TEXT($AW$5,),SchemaTD,2,0)),\"\",VLOOKUP(TEXT($B22,)&\" - \"&TEXT($AW$5,),SchemaTD,2,0))","v":""},{"$f":"IF(ISBLANK(VLOOKUP(TEXT($B22,)&\" - \"&TEXT($AW$5,),SchemaTD,3,0)),\"\",VLOOKUP(TEXT($B22,)&\" - \"&TEXT($AW$5,),SchemaTD,3,0))","v":""},"",null,null,null,"","","",0,0,1,0,2,null,17,"Jong Almere City FC",1,0,0,1,null,0,-2,0,2,980009910]
[null,"De Treffers",null,1,4,"v","","","","","","","","","","","","","","","","","","","","","","","","","","","","","","","","","",{"$f":"IF(ISBLANK(VLOOKUP(TEXT($B23,)&\" - \"&TEXT($AN$5,),SchemaTD,2,0)),\"\",VLOOKUP(TEXT($B23,)&\" - \"&TEXT($AN$5,),SchemaTD,2,0))","v":""},{"$f":"IF(ISBLANK(VLOOKUP(TEXT($B23,)&\" - \"&TEXT($AN$5,),SchemaTD,3,0)),\"\",VLOOKUP(TEXT($B23,)&\" - \"&TEXT($AN$5,),SchemaTD,3,0))","v":""},"",{"$f":"IF(ISBLANK(VLOOKUP(TEXT($B23,)&\" - \"&TEXT($AQ$5,),SchemaTD,2,0)),\"\",VLOOKUP(TEXT($B23,)&\" - \"&TEXT($AQ$5,),SchemaTD,2,0))","v":""},{"$f":"IF(ISBLANK(VLOOKUP(TEXT($B23,)&\" - \"&TEXT($AQ$5,),SchemaTD,3,0)),\"\",VLOOKUP(TEXT($B23,)&\" - \"&TEXT($AQ$5,),SchemaTD,3,0))","v":""},"",{"$f":"IF(ISBLANK(VLOOKUP(TEXT($B23,)&\" - \"&TEXT($AT$5,),SchemaTD,2,0)),\"\",VLOOKUP(TEXT($B23,)&\" - \"&TEXT($AT$5,),SchemaTD,2,0))","v":""},{"$f":"IF(ISBLANK(VLOOKUP(TEXT($B23,)&\" - \"&TEXT($AT$5,),SchemaTD,3,0)),\"\",VLOOKUP(TEXT($B23,)&\" - \"&TEXT($AT$5,),SchemaTD,3,0))","v":""},"",{"$f":"IF(ISBLANK(VLOOKUP(TEXT($B23,)&\" - \"&TEXT($AW$5,),SchemaTD,2,0)),\"\",VLOOKUP(TEXT($B23,)&\" - \"&TEXT($AW$5,),SchemaTD,2,0))","v":""},{"$f":"IF(ISBLANK(VLOOKUP(TEXT($B23,)&\" - \"&TEXT($AW$5,),SchemaTD,3,0)),\"\",VLOOKUP(TEXT($B23,)&\" - \"&TEXT($AW$5,),SchemaTD,3,0))","v":""},"",{"$f":"IF(ISBLANK(VLOOKUP(TEXT($B23,)&\" - \"&TEXT($AZ$5,),SchemaTD,2,0)),\"\",VLOOKUP(TEXT($B23,)&\" - \"&TEXT($AZ$5,),SchemaTD,2,0))","v":""},{"$f":"IF(ISBLANK(VLOOKUP(TEXT($B23,)&\" - \"&TEXT($AZ$5,),SchemaTD,3,0)),\"\",VLOOKUP(TEXT($B23,)&\" - \"&TEXT($AZ$5,),SchemaTD,3,0))","v":""},"",null,null,null,0,0,1,1,4,null,18,"De Treffers",1,0,0,1,null,0,-3,1,4,970019916]
[]
[null,"Winst uit",null,{"$f":"COUNTIF(F$6:F$23,\"v\")","v":1},null,null,{"$f":"COUNTIF(I$6:I$23,\"v\")","v":1},null,null,{"$f":"COUNTIF(L$6:L$23,\"v\")","v":0},null,null,{"$f":"COUNTIF(O$6:O$23,\"v\")","v":1},null,null,{"$f":"COUNTIF(R$6:R$23,\"v\")","v":1},null,null,{"$f":"COUNTIF(U$6:U$23,\"v\")","v":1},null,null,{"$f":"COUNTIF(X$6:X$23,\"v\")","v":0},null,null,{"$f":"COUNTIF(AA$6:AA$23,\"v\")","v":0},null,null,{"$f":"COUNTIF(AD$6:AD$23,\"v\")","v":0},null,null,{"$f":"COUNTIF(AG$6:AG$23,\"v\")","v":0},null,null,{"$f":"COUNTIF(AJ$6:AJ$23,\"v\")","v":0},null,null,{"$f":"COUNTIF(AM$6:AM$23,\"v\")","v":0},null,null,{"$f":"COUNTIF(AP$6:AP$23,\"v\")","v":0},null,null,{"$f":"COUNTIF(AS$6:AS$23,\"v\")","v":0},null,null,{"$f":"COUNTIF(AV$6:AV$23,\"v\")","v":0},null,null,{"$f":"COUNTIF(AY$6:AY$23,\"v\")","v":0},null,null,{"$f":"COUNTIF(BB$6:BB$23,\"v\")","v":0},null,null,{"$f":"COUNTIF(BE$6:BE$23,\"v\")","v":0},null,null,null,null,null,null,null,null,null," Promotie"]
[null,"Gelijk uit",null,{"$f":"COUNTIF(F$6:F$23,\"g\")","v":0},null,null,{"$f":"COUNTIF(I$6:I$23,\"g\")","v":0},null,null,{"$f":"COUNTIF(L$6:L$23,\"g\")","v":0},null,null,{"$f":"COUNTIF(O$6:O$23,\"g\")","v":0},null,null,{"$f":"COUNTIF(R$6:R$23,\"g\")","v":0},null,null,{"$f":"COUNTIF(U$6:U$23,\"g\")","v":0},null,null,{"$f":"COUNTIF(X$6:X$23,\"g\")","v":0},null,null,{"$f":"COUNTIF(AA$6:AA$23,\"g\")","v":0},null,null,{"$f":"COUNTIF(AD$6:AD$23,\"g\")","v":1},null,null,{"$f":"COUNTIF(AG$6:AG$23,\"g\")","v":0},null,null,{"$f":"COUNTIF(AJ$6:AJ$23,\"g\")","v":0},null,null,{"$f":"COUNTIF(AM$6:AM$23,\"g\")","v":0},null,null,{"$f":"COUNTIF(AP$6:AP$23,\"g\")","v":0},null,null,{"$f":"COUNTIF(AS$6:AS$23,\"g\")","v":0},null,null,{"$f":"COUNTIF(AV$6:AV$23,\"g\")","v":0},null,null,{"$f":"COUNTIF(AY$6:AY$23,\"g\")","v":0},null,null,{"$f":"COUNTIF(BB$6:BB$23,\"g\")","v":0},null,null,{"$f":"COUNTIF(BE$6:BE$23,\"g\")","v":0},null,null,null,null,null,null,null,null,null," Play-offs"]
[null,"Verlies uit",null,{"$f":"COUNTIF(F$6:F$23,\"w\")","v":0},null,null,{"$f":"COUNTIF(I$6:I$23,\"w\")","v":0},null,null,{"$f":"COUNTIF(L$6:L$23,\"w\")","v":0},null,null,{"$f":"COUNTIF(O$6:O$23,\"w\")","v":0},null,null,{"$f":"COUNTIF(R$6:R$23,\"w\")","v":0},null,null,{"$f":"COUNTIF(U$6:U$23,\"w\")","v":0},null,null,{"$f":"COUNTIF(X$6:X$23,\"w\")","v":0},null,null,{"$f":"COUNTIF(AA$6:AA$23,\"w\")","v":0},null,null,{"$f":"COUNTIF(AD$6:AD$23,\"w\")","v":0},null,null,{"$f":"COUNTIF(AG$6:AG$23,\"w\")","v":0},null,null,{"$f":"COUNTIF(AJ$6:AJ$23,\"w\")","v":0},null,null,{"$f":"COUNTIF(AM$6:AM$23,\"w\")","v":1},null,null,{"$f":"COUNTIF(AP$6:AP$23,\"w\")","v":1},null,null,{"$f":"COUNTIF(AS$6:AS$23,\"w\")","v":0},null,null,{"$f":"COUNTIF(AV$6:AV$23,\"w\")","v":1},null,null,{"$f":"COUNTIF(AY$6:AY$23,\"w\")","v":0},null,null,{"$f":"COUNTIF(BB$6:BB$23,\"w\")","v":0},null,null,{"$f":"COUNTIF(BE$6:BE$23,\"w\")","v":0},null,null,null,null,null,null,null,null,null," Degradatie"]
[null,"Vóór uit",null,{"$f":"SUM(E6:E23)","v":4},null,null,{"$f":"SUM(H6:H23)","v":3},null,null,{"$f":"SUM(K6:K23)","v":0},null,null,{"$f":"SUM(N6:N23)","v":2},null,null,{"$f":"SUM(Q6:Q23)","v":2},null,null,{"$f":"SUM(T6:T23)","v":1},null,null,{"$f":"SUM(W6:W23)","v":0},null,null,{"$f":"SUM(Z6:Z23)","v":0},null,null,{"$f":"SUM(AC6:AC23)","v":2},null,null,{"$f":"SUM(AF6:AF23)","v":0},null,null,{"$f":"SUM(AI6:AI23)","v":0},null,null,{"$f":"SUM(AL6:AL23)","v":0},null,null,{"$f":"SUM(AO6:AO23)","v":0},null,null,{"$f":"SUM(AR6:AR23)","v":0},null,null,{"$f":"SUM(AU6:AU23)","v":1},null,null,{"$f":"SUM(AX6:AX23)","v":0},null,null,{"$f":"SUM(BA6:BA23)","v":0},null,null,{"$f":"SUM(BD6:BD23)","v":0}]
[null,"Tegen uit",null,{"$f":"SUM(D6:D23)","v":1},null,null,{"$f":"SUM(G6:G23)","v":1},null,null,{"$f":"SUM(J6:J23)","v":0},null,null,{"$f":"SUM(M6:M23)","v":0},null,null,{"$f":"SUM(P6:P23)","v":1},null,null,{"$f":"SUM(S6:S23)","v":0},null,null,{"$f":"SUM(V6:V23)","v":0},null,null,{"$f":"SUM(Y6:Y23)","v":0},null,null,{"$f":"SUM(AB6:AB23)","v":2},null,null,{"$f":"SUM(AE6:AE23)","v":0},null,null,{"$f":"SUM(AH6:AH23)","v":0},null,null,{"$f":"SUM(AK6:AK23)","v":1},null,null,{"$f":"SUM(AN6:AN23)","v":1},null,null,{"$f":"SUM(AQ6:AQ23)","v":0},null,null,{"$f":"SUM(AT6:AT23)","v":3},null,null,{"$f":"SUM(AW6:AW23)","v":0},null,null,{"$f":"SUM(AZ6:AZ23)","v":0},null,null,{"$f":"SUM(BC6:BC23)","v":0}]

{"sheet":"Nacompetitie","index":6,"n_rows":68,"n_cols":41,"rows_kept":68,"cut":false,"hidden":false,"merged":[[0,1,0,41],[5,39,6,39],[5,40,6,40],[8,2,9,2],[8,3,9,3],[8,38,9,38],[8,39,9,39],[8,40,9,40],[3,2,3,3],[3,17,3,25],[3,28,3,36],[5,2,6,2],[5,3,6,3],[5,38,6,38],[13,39,14,39],[13,40,14,40],[16,2,17,2],[16,3,17,3],[16,38,17,38],[16,39,17,39],[16,40,17,40],[11,2,11,3],[11,17,11,25],[11,28,11,36],[13,2,14,2],[13,3,14,3],[13,38,14,38],[19,40,20,40],[22,2,23,2],[22,3,23,3],[22,16,23,16],[22,27,23,27],[22,38,23,38],[22,39,23,39],[22,40,23,40],[19,2,20,2],[19,3,20,3],[19,16,20,16],[19,38,20,38],[19,39,20,39],[25,39,26,39],[25,40,26,40],[28,2,29,2],[28,3,29,3],[28,16,29,16],[28,38,29,38],[28,39,29,39],[28,40,29,40],[25,2,26,2],[25,3,26,3],[25,16,26,16],[25,27,26,27],[25,38,26,38],[37,2,38,2],[37,3,38,3],[37,5,38,5],[37,38,38,38],[37,39,38,39],[37,40,38,40],[40,39,41,39],[40,40,41,40],[32,2,32,3],[32,6,32,14],[32,17,32,25],[32,28,32,36],[34,2,35,2],[34,3,35,3],[34,38,35,38],[34,39,35,39],[34,40,35,40],[43,2,44,2],[43,3,44,3],[43,16,44,16],[43,27,44,27],[43,38,44,38],[43,39,44,39],[43,40,44,40],[40,2,41,2],[40,3,41,3],[40,5,41,5],[40,16,41,16],[40,38,41,38],[46,39,47,39],[46,40,47,40],[49,2,50,2],[49,3,50,3],[49,16,50,16],[49,38,50,38],[49,39,50,39],[49,40,50,40],[46,2,47,2],[46,3,47,3],[46,16,47,16],[46,27,47,27],[46,38,47,38],[52,40,53,40],[55,2,56,2],[55,3,56,3],[55,16,56,16],[55,27,56,27],[55,38,56,38],[55,39,56,39],[55,40,56,40],[52,2,53,2],[52,3,53,3],[52,16,53,16],[52,38,53,38],[52,39,53,39],[58,39,59,39],[58,40,59,40],[61,2,62,2],[61,3,62,3],[61,5,62,5],[61,16,62,16],[61,38,62,38],[61,39,62,39],[61,40,62,40],[58,2,59,2],[58,3,59,3],[58,16,59,16],[58,27,59,27],[58,38,59,38],[67,2,68,2],[67,3,68,3],[67,38,68,38],[67,39,68,39],[67,40,68,40],[64,2,65,2],[64,3,65,3],[64,5,65,5],[64,38,65,38],[64,39,65,39],[64,40,65,40]]}
[null,{"$f":"\"Competitie \"&Comp","v":"Competitie 2018-2019"}]
[]
[]
[null,null,"Champions Leage"]
[]
[null,null,{"$f":"Eredivisie!BZ8","v":"PSV"},"1e Eredivisie",null,null,null,null,null,null,null,null,null,null,null,null,null,null,null,null,null,null,null,null,null,null,null,null,null,null,null,null,null,null,null,null,null,null,">",{"$f":"C6","v":"PSV"},"CL Groepsfase"]
[]
[]
[null,null,{"$f":"Eredivisie!BZ9","v":"AZ Alkmaar"},"2e Eredivisie",null,null,null,null,null,null,null,null,null,null,null,null,null,null,null,null,null,null,null,null,null,null,null,null,null,null,null,null,null,null,null,null,null,null,">",{"$f":"C9","v":"AZ Alkmaar"},"CL 3ᵉ voorronde"]
[]
[]
[null,null,"Europa Leage",null,null,null,null,null,null,null,null,null,null,null,null,null,null,"1e ronde ",null,null,null,null,null,null,null,null,null,null,"2e ronde "]
[]
[null,null,{"$f":"Eredivisie!BZ10","v":"AFC Ajax"},"3e Eredivisie",null,null,null,null,null,null,null,null,null,null,null,null,null,null,null,null,null,null,null,null,null,null,null,null,null,null,null,null,null,null,null,null,null,null,">",{"$f":"C14","v":"AFC Ajax"},"EL 3ᵉ voorronde "]
[]
[]
[null,null,{"$f":"IF(ISBLANK(Eredivisie!BZ12),\"\",Eredivisie!BZ12)","v":""},"Bekerwinnaar",null,null,null,null,null,null,null,null,null,null,null,null,null,null,null,null,null,null,null,null,null,null,null,null,null,null,null,null,null,null,null,null,null,null,">",{"$f":"C17","v":""},"EL Groepsfase"]
[]
[null,null,null,null,null,null,null,null,null,null,null,null,null,null,null,null,null,null,null,null,"A"]
[null,null,{"$f":"Eredivisie!BZ17","v":"VVV-Venlo"},"Eredivisie",null,null,null,null,null,null,null,null,null,null,null,null,">"]
[null,null,null,null,null,null,null,null,null,null,null,null,null,null,null,null,null,null,{"$f":"C20","v":"VVV-Venlo"},"-",{"$f":"S23","v":"Willem II"}]
[null,null,null,null,null,null,null,null,null,null,null,null,null,null,null,null,null,null,null,null,null,null,null,null,null,null,null,null,null,null,null,"C"]
[null,null,{"$f":"Eredivisie!BZ14","v":"Willem II"},"Eredivisie",null,null,null,null,null,null,null,null,null,null,null,null,">",null,{"$f":"C23","v":"Willem II"},"-",{"$f":"S21","v":"VVV-Venlo"},null,null,null,null,null,null,">",null,null,null,null,null,null,null,null,null,null,">",{"$f":"IF(ISBLANK($AH$26),\"\",IF(($AG$24+$AH$26+$AJ$24)>($AH$24+$AG$26+$AJ$26),$AD$24,$AF$24))","v":""},"Europa Leage"]
[null,null,null,null,null,null,null,null,null,null,null,null,null,null,null,null,null,null,null,null,null,null,null,null,null,null,null,null,null,{"$f":"IF(ISBLANK($W$21),\"\",IF(($V$21+$W$23+$Y$21)>($W$21+$V$23+$Y$23),S$21,U$21))","v":""},"-",{"$f":"AD26","v":""},null,null,null,null,null,null,null,{"$f":"IF(($V$42+$W$44)>($W$42+$V$44),AC$42,AE$42)","v":0}]
[null,null,null,null,null,null,null,null,null,null,null,null,null,null,null,null,null,null,null,null,"B"]
[null,null,{"$f":"Eredivisie!BZ16","v":"Vitesse"},"Eredivisie",null,null,null,null,null,null,null,null,null,null,null,null,">",null,null,null,null,null,null,null,null,null,null,">",null,{"$f":"IF(ISBLANK($W$27),\"\",IF(($V$27+$W$29+$Y$27)>($W$27+$V$29+$Y$29),S$27,U$27))","v":""},"-",{"$f":"AD24","v":""}]
[null,null,null,null,null,null,null,null,null,null,null,null,null,null,null,null,null,null,{"$f":"C26","v":"Vitesse"},"-",{"$f":"C29","v":"Feyenoord"}]
[]
[null,null,{"$f":"Eredivisie!BZ15","v":"Feyenoord"},"6e Eredivisie",null,null,null,null,null,null,null,null,null,null,null,null,">",null,{"$f":"U27","v":"Feyenoord"},"-",{"$f":"S27","v":"Vitesse"}]
[]
[]
[]
[null,null,"Promotie-Degradatie",null,null,null,"1e ronde ",null,null,null,null,null,null,null,null,null,null,"halve finale ",null,null,null,null,null,null,null,null,null,null,"finale "]
[]
[null,null,{"$f":"KeukenKampioenDivisie!CF22","v":"Go Ahead Eagles"},"1e Keuken Kampioen",null,null,null,null,null,null,null,null,null,null,null,null,null,null,null,null,null,null,null,null,null,null,null,null,null,null,null,null,null,null,null,null,null,null,">",{"$f":"C35","v":"Go Ahead Eagles"},"Eredivisie"]
[]
[null,null,null,null,null,null,null,null,null,"A"]
[null,null,{"$f":"KeukenKampioenDivisie!CF28","v":"Almere City FC"},"6e Keuken Kampioen",null,">"]
[null,null,null,null,null,null,null,{"$f":"C41","v":"FC Eindhoven"},"-",{"$f":"C38","v":"Almere City FC"}]
[null,null,null,null,null,null,null,null,null,null,null,null,null,null,null,null,null,null,null,null,"C"]
[null,null,{"$f":"KeukenKampioenDivisie!CF31","v":"FC Eindhoven"},"9e Keuken Kampioen",null,">",null,{"$f":"J39","v":"Almere City FC"},"-",{"$f":"H39","v":"FC Eindhoven"},null,null,null,null,null,null,">"]
[null,null,null,null,null,null,null,null,null,null,null,null,null,null,null,null,null,null,{"$f":"IF(ISBLANK($L$39),\"\",IF(($K$39+$L$41+$N$39)>($L$39+$K$41+$N$41),H$39,J$39))","v":""},"-",{"$f":"S44","v":""}]
[null,null,null,null,null,null,null,null,null,null,null,null,null,null,null,null,null,null,null,null,null,null,null,null,null,null,null,null,null,null,null,"G"]
[null,null,{"$f":"IFERROR(VLOOKUP(17,Eredivisie!$BL$6:$BM$23,2,0),\"niet aanwezig\")","v":"Fortuna Sittard"},"17e Eredivisie",null,null,null,null,null,null,null,null,null,null,null,null,">",null,{"$f":"IF(ISBLANK($L$39),\"\",C44)","v":""},"-",{"$f":"S42","v":""},null,null,null,null,null,null,">",null,null,null,null,null,null,null,null,null,null,">",{"$f":"IF(ISBLANK($AH$47),\"\",IF(($AG$45+$AH$47)>($AH$45+$AG$47),$AD$45,$AF$45))","v":""},"Eredivisie"]
[null,null,null,null,null,null,null,null,null,null,null,null,null,null,null,null,null,null,null,null,null,null,null,null,null,null,null,null,null,{"$f":"IF(ISBLANK($W$44),\"\",IF(($V$42+$W$44+$Y$42)>($W$42+$V$44+$Y$44),S$42,U$42))","v":""},"-",{"$f":"AD47","v":""},null,null,null,null,null,null,null,{"$f":"IF(($V$42+$W$44)>($W$42+$V$44),AC$42,AE$42)","v":0}]
[]
[null,null,{"$f":"KeukenKampioenDivisie!CF27","v":"FC Twente"},"5e Keuken Kampioen",null,null,null,null,null,null,null,null,null,null,null,null,">",null,null,null,"D",null,null,null,null,null,null,">",null,{"$f":"IF(ISBLANK($W$50),\"\",IF(($V$48+$W$50+$Y$48)>($W$48+$V$50+$Y$50),S$48,U$48))","v":""},"-",{"$f":"AD45","v":""}]
[null,null,null,null,null,null,null,null,null,null,null,null,null,null,null,null,null,null,{"$f":"C47","v":"FC Twente"},"-",{"$f":"C50","v":"TOP Oss"}]
[]
[null,null,{"$f":"KeukenKampioenDivisie!CF24","v":"TOP Oss"},"2e Keuken Kampioen",null,null,null,null,null,null,null,null,null,null,null,null,">",null,{"$f":"U48","v":"TOP Oss"},"-",{"$f":"S48","v":"FC Twente"}]
[]
[null,null,null,null,null,null,null,null,null,null,null,null,null,null,null,null,null,null,null,null,"E"]
[null,null,{"$f":"KeukenKampioenDivisie!CF26","v":"Roda JC Kerkrade"},"4e Keuken Kampioen",null,null,null,null,null,null,null,null,null,null,null,null,">"]
[null,null,null,null,null,null,null,null,null,null,null,null,null,null,null,null,null,null,{"$f":"C53","v":"Roda JC Kerkrade"},"-",{"$f":"C56","v":"RKC Waalwijk"}]
[null,null,null,null,null,null,null,null,null,null,null,null,null,null,null,null,null,null,null,null,null,null,null,null,null,null,null,null,null,null,null,"H"]
[null,null,{"$f":"KeukenKampioenDivisie!CF25","v":"RKC Waalwijk"},"3e Keuken Kampioen",null,null,null,null,null,null,null,null,null,null,null,null,">",null,{"$f":"U54","v":"RKC Waalwijk"},"-",{"$f":"S54","v":"Roda JC Kerkrade"},null,null,null,null,null,null,">"]
[null,null,null,null,null,null,null,null,null,null,null,null,null,null,null,null,null,null,null,null,null,null,null,null,null,null,null,null,null,{"$f":"IF(ISBLANK($W$56),\"\",IF(($V$54+$W$56+$Y$54)>($W$54+$V$56+$Y$56),S$54,U$54))","v":""},"-",{"$f":"AD59","v":""}]
[null,null,null,null,null,null,null,null,null,null,null,null,null,null,null,null,null,null,null,null,"F"]
[null,null,{"$f":"IFERROR(VLOOKUP(16,Eredivisie!$BL$6:$BM$23,2,0),\"niet aanwezig\")","v":"FC Emmen"},"16e Eredivisie",null,null,null,null,null,null,null,null,null,null,null,null,">",null,null,null,null,null,null,null,null,null,null,">",null,{"$f":"IF(ISBLANK($W$62),\"\",IF(($V$60+$W$62+$Y$60)>($W$60+$V$62+$Y$62),S$60,U$60))","v":""},"-",{"$f":"AD57","v":""},null,null,null,null,null,null,">",{"$f":"IF(ISBLANK($AH$59),\"\",IF(($AG$57+$AH$59)>($AH$57+$AG$59),$AD$57,$AF$57))","v":""},"Eredivisie"]
[null,null,null,null,null,null,null,null,null,null,null,null,null,null,null,null,null,null,{"$f":"IF(ISBLANK($L$63),\"\",C59)","v":""},"-",{"$f":"S62","v":""},null,null,null,null,null,null,null,null,null,null,null,null,null,null,null,null,null,null,{"$f":"IF(($V$42+$W$44)>($W$42+$V$44),AC$42,AE$42)","v":0}]
[null,null,null,null,null,null,null,null,null,"B"]
[null,null,{"$f":"KeukenKampioenDivisie!CF29","v":"FC Den Bosch"},"7e Keuken Kampioen",null,">",null,null,null,null,null,null,null,null,null,null,">",null,{"$f":"IF(ISBLANK($L$63),\"\",IF(($K$63+$L$65+$N$63)>($L$63+$K$65+$N$65),H$63,J$63))","v":""},"-",{"$f":"S60","v":""}]
[null,null,null,null,null,null,null,{"$f":"C65","v":"FC Dordrecht"},"-",{"$f":"C62","v":"FC Den Bosch"}]
[]
[null,null,{"$f":"KeukenKampioenDivisie!CF30","v":"FC Dordrecht"},"8e Keuken Kampioen",null,">",null,{"$f":"J63","v":"FC Den Bosch"},"-",{"$f":"H63","v":"FC Dordrecht"}]
[]
[]
[null,null,{"$f":"IFERROR(VLOOKUP(18,Eredivisie!$BL$6:$BM$23,2,0),\"niet aanwezig\")","v":"PEC Zwolle"},"18e Eredivisie",null,null,null,null,null,null,null,null,null,null,null,null,null,null,null,null,null,null,null,null,null,null,null,null,null,null,null,null,null,null,null,null,null,null,">",{"$f":"C68","v":"PEC Zwolle"},"Keuken Kampioen"]